What's new

Welcome to Onforum.net - Web and gaming resource community

Join us now to get access to all our features. Once registered and logged in, you will be able to create topics, post replies to existing threads, give reputation to your fellow members, get your own private messenger, and so, so much more. It's also quick and totally free, so what are you waiting for?

Ask question

Ask Questions and Get Answers from Our Community

Answer

Answer Questions and Become an Expert on Your Topic

Contact Staff

Our Experts are Ready to Answer your Questions

I cant compile everything

Status
Not open for further replies.

Cunoo

Banned
Banned
Joined
May 9, 2019
Messages
37
Reaction score
103
Points
18
Credits
0
Hello @Cunoo , please show me your Makefile from the game src.
thank you for answer you can download files but here:

Makefile db:

MAKE = gmake
CC = g++

INCDIR =
LIBDIR =
BINDIR = ..
OBJDIR = .obj

GCC_VERSION = $(shell $(CC) --version 2>&1 | grep "(GCC)" | cut -d' ' -f3 | cut -d'.' -f1)
BSD_VERSION = $(shell uname -v 2>&1 | cut -d' ' -f2 | cut -d'.' -f1)
P4_VERSION = 40153
WOLF_ENABLE = lycan
$(shell if [ ! -d $(OBJDIR) ]; then mkdir $(OBJDIR); fi)

TARGET = $(BINDIR)/db_r$(P4_VERSION)_$(WOLF_ENABLE)

CFLAGS = -g -Wall -O2 -pipe -fno-rtti -fno-exceptions -pthread -D_THREAD_SAFE

ifeq ($(GCC_VERSION), 4)
CFLAGS += -mtune=i686
else
CFLAGS += -mcpu=i686
endif

# boost
INCDIR += -I../../boost

LIBDIR += -L../../libthecore/lib -L../../libsql -L../../libpoly -L../../libgame/lib
LIBDIR += -L/usr/local/lib/mysql

ifeq ($(BSD_VERSION), 7)
INCDIR += -I../../libmysql/7.x-5.1.35
LIBDIR += -L../../libmysql/7.x-5.1.35
else
INCDIR += -I../../libmysql/5.x-5.1.35
LIBDIR += -L../../libmysql/5.x-5.1.35
endif

LIBS = -lthecore -lmysqlclient -lsql -lpoly -lgame -lm -lz

SRCS = Config.cpp NetBase.cpp Peer.cpp PeerBase.cpp Main.cpp Lock.cpp DBManager.cpp \
Cache.cpp LoginData.cpp ClientManager.cpp ClientManagerPlayer.cpp ClientManagerLogin.cpp \
ClientManagerBoot.cpp ClientManagerParty.cpp ClientManagerGuild.cpp GuildManager.cpp HB.cpp \
PrivManager.cpp MoneyLog.cpp ItemAwardManager.cpp ClientManagerEventFlag.cpp Marriage.cpp \
Monarch.cpp BlockCountry.cpp ItemIDRangeManager.cpp ClientManagerHorseName.cpp version.cpp \
AuctionManager.cpp ProtoReader.cpp CsvReader.cpp

OBJS = $(SRCS:%.cpp=$(OBJDIR)/%.o)

default: $(TARGET)

$(TARGET): $(OBJS)
@echo DB Olusturuldu
@$(CC) -w $(CFLAGS) $(LIBDIR) $(OBJS) $(LIBS) -o $(TARGET)
@touch version.cpp

$(OBJDIR)/%.o: %.cpp
@echo Derleniyor $<
@$(CC) -w $(CFLAGS) $(INCDIR) -c $< -o [email protected]

$(OBJDIR)/version.o: version.cpp
@$(CC) -w $(CFLAGS) -D__USER__=\"$(USER)\" -D__HOSTNAME__=\"$(HOSTNAME)\" -D__PWD__=\"$(PWD)\" -D__P4_VERSION__=\"$(P4_VERSION)\" -c $< -o [email protected]
@echo Derleniyor $<

$(OBJDIR):
@mkdir $(OBJDIR)

clean:
@rm -f $(OBJS) $(BINDIR)/db_r*

dep:
@touch Depend
makedepend -fDepend $(INCDIR) -I/usr/include/c++/3.3 -I/usr/include/c++/4.2 -p$(OBJDIR)/ $(SRCS) 2> /dev/null

sinclude Depend





MAKEFILE GAME

PLATFORM = $(shell file /bin/ls | cut -d' ' -f3 | cut -d'-' -f1)

GCC_VERSION = $(shell $(CC) --version 2>&1 | grep "(GCC)" | cut -d' ' -f3 | cut -d'.' -f1)
BSD_VERSION = $(shell uname -v 2>&1 | cut -d' ' -f2 | cut -d'.' -f1)
P4_VERSION = 40250
WOLF_ENABLE = lycan

CC = g++

INCDIR =
LIBDIR =
BINDIR = ..
OBJDIR = OBJDIR
$(shell if [ ! -d $(OBJDIR) ]; then mkdir $(OBJDIR); fi)

# Standard Setting
LIBS = -pthread -lm -lmd
# Removed -fno-rtti
CFLAGS = -g -w -Wall -O2 -m32 -pipe -fexceptions -D_THREAD_SAFE -DNDEBUG

ifeq ($(GCC_VERSION), 4)
CFLAGS += -mtune=i686 -fstack-protector-all
else
CFLAGS += -mcpu=i686
endif

# boost
INCDIR += -I../../../Extern/include/boost

# DevIL
INCDIR += -I../../libdevil
LIBDIR += -L../../libdevil
LIBS += -lIL -lpng -ltiff -lmng -llcms -ljpeg

# MySQL
#ifeq ($(BSD_VERSION), 7)
INCDIR += -I../../libmysql/7.x-5.1.35
LIBDIR += -L../../libmysql/7.x-5.1.35
#else
#INCDIR += -I../../libmysql/5.x-5.1.35
#LIBDIR += -L../../libmysql/5.x-5.1.35
#endif

LIBS += -lmysqlclient -L/usr/local/lib/mysql -lz

# Miscellaneous external libraries
INCDIR += -I../../../Extern/include
LIBDIR += -L../../../Extern/lib
LIBS += -lcryptopp -lgtest

# HackShield
INCDIR += -I../../libhackshield/include
LIBDIR += -L../../libhackshield/lib
LIBS += -lanticpxsvr

# XTrap
INCDIR += -I../../libxtrap/include

# openssl
#INCDIR += -I/usr/include
#LIBS += -lssl
#LIBS += /usr/lib/libssl.a

# Project Library
INCDIR += -I../../liblua/include
INCDIR += -I/usr/local/include
INCDIR += -L/usr/local/lib/mysql
LIBDIR += -L../../libthecore/lib -L../../libpoly -L../../libsql -L../../libgame/lib -L../../liblua/lib
LIBDIR += -L/usr/local/lib
LIBS += -lthecore -lpoly -llua -llualib -lsql -lgame
USE_STACKTRACE = 0
ifeq ($(USE_STACKTRACE), 1)
LIBS += /usr/local/lib/libexecinfo.a
endif

TARGET = $(BINDIR)/game_r$(P4_VERSION)_$(WOLF_ENABLE)

CFILE = minilzo.c

CPPFILE = BattleArena.cpp FSM.cpp MarkConvert.cpp MarkImage.cpp MarkManager.cpp OXEvent.cpp TrafficProfiler.cpp acce.cpp ani.cpp\
arena.cpp banword.cpp battle.cpp blend_item.cpp block_country.cpp buffer_manager.cpp building.cpp castle.cpp\
char.cpp char_affect.cpp char_battle.cpp char_change_empire.cpp char_horse.cpp char_item.cpp char_manager.cpp\
char_quickslot.cpp char_resist.cpp char_skill.cpp char_state.cpp PetSystem.cpp cmd.cpp cmd_emotion.cpp cmd_general.cpp\
cmd_gm.cpp cmd_oxevent.cpp config.cpp constants.cpp crc32.cpp cube.cpp db.cpp desc.cpp\
desc_client.cpp desc_manager.cpp desc_p2p.cpp dev_log.cpp dungeon.cpp empire_text_convert.cpp entity.cpp\
entity_view.cpp event.cpp event_queue.cpp exchange.cpp file_loader.cpp fishing.cpp gm.cpp guild.cpp\
guild_manager.cpp guild_war.cpp horse_rider.cpp horsename_manager.cpp input.cpp input_auth.cpp input_db.cpp\
input_login.cpp input_main.cpp input_p2p.cpp input_teen.cpp input_udp.cpp ip_ban.cpp\
item.cpp item_addon.cpp item_attribute.cpp item_manager.cpp item_manager_idrange.cpp locale.cpp\
locale_service.cpp log.cpp login_data.cpp lzo_manager.cpp marriage.cpp matrix_card.cpp\
messenger_manager.cpp mining.cpp mob_manager.cpp monarch.cpp motion.cpp over9refine.cpp p2p.cpp packet_info.cpp\
party.cpp passpod.cpp pcbang.cpp polymorph.cpp priv_manager.cpp pvp.cpp\
questevent.cpp questlua.cpp questlua_affect.cpp questlua_arena.cpp questlua_ba.cpp questlua_building.cpp\
questlua_danceevent.cpp questlua_dungeon.cpp questlua_forked.cpp questlua_game.cpp questlua_global.cpp\
questlua_guild.cpp questlua_horse.cpp questlua_pet.cpp questlua_item.cpp questlua_marriage.cpp questlua_mgmt.cpp\
questlua_monarch.cpp questlua_npc.cpp questlua_oxevent.cpp questlua_party.cpp questlua_pc.cpp\
questlua_quest.cpp questlua_target.cpp questmanager.cpp questnpc.cpp questpc.cpp\
refine.cpp regen.cpp safebox.cpp sectree.cpp sectree_manager.cpp sequence.cpp shop.cpp\
skill.cpp start_position.cpp target.cpp text_file_loader.cpp trigger.cpp utils.cpp vector.cpp war_map.cpp\
wedding.cpp xmas_event.cpp version.cpp panama.cpp threeway_war.cpp map_location.cpp auth_brazil.cpp\
BlueDragon.cpp BlueDragon_Binder.cpp DragonLair.cpp questlua_dragonlair.cpp\
HackShield.cpp HackShield_Impl.cpp char_hackshield.cpp skill_power.cpp affect.cpp\
SpeedServer.cpp questlua_speedserver.cpp XTrapManager.cpp\
auction_manager.cpp FileMonitor_FreeBSD.cpp ClientPackageCryptInfo.cpp cipher.cpp\
buff_on_attributes.cpp dragon_soul_table.cpp DragonSoul.cpp\
group_text_parse_tree.cpp char_dragonsoul.cpp questlua_dragonsoul.cpp\
shop_manager.cpp shopEx.cpp item_manager_read_tables.cpp questlua_mysql.cpp New_PetSystem.cpp questlua_petnew.cpp\
offline_shop.cpp offlineshop_manager.cpp offlineshop_config.cpp item_combination.cpp char_cards.cpp\
MeleyLair.cpp questlua_MeleyLair.cpp

COBJS = $(CFILE:%.c=$(OBJDIR)/%.o)
CPPOBJS = $(CPPFILE:%.cpp=$(OBJDIR)/%.o)

MAINOBJ = $(OBJDIR)/main.o
MAINCPP = main.cpp

default: $(TARGET)

$(OBJDIR)/minilzo.o: minilzo.c
@$(CC) -w $(CFLAGS) $(INCDIR) -c $< -o [email protected]
@echo Derleniyor $<

$(OBJDIR)/version.o: version.cpp
@$(CC) -w $(CFLAGS) -D__USER__=\"$(USER)\" -D__HOSTNAME__=\"$(HOSTNAME)\" -D__PWD__=\"$(PWD)\" -D__P4_VERSION__=\"$(P4_VERSION)\" -c $< -o [email protected]
@echo Derleniyor $<

$(OBJDIR)/%.o: %.cpp
@echo Derleniyor $<
@$(CC) -w $(CFLAGS) $(INCDIR) -c $< -o [email protected]

$(TARGET): $(CPPOBJS) $(COBJS) $(MAINOBJ)
@echo Game Olusturuldu $(TARGET)
@$(CC) -w $(CFLAGS) $(LIBDIR) $(COBJS) $(CPPOBJS) $(MAINOBJ) $(LIBS) -o $(TARGET)

clean:
@rm -f $(COBJS) $(CPPOBJS)
@rm -f $(BINDIR)/game_r* $(BINDIR)/conv

tag:
ctags *.cpp *.h *.c

dep:
makedepend -f Depend $(INCDIR) -I/usr/include/c++/3.3 -I/usr/include/c++/4.2 -p$(OBJDIR)/ $(CPPFILE) $(CFILE) $(MAINCPP) $(TESTCPP) 2> /dev/null > Depend

sinclude Depend
 
Last edited by a moderator:

TeoDoR

SuperModerator
SuperModerator
Joined
Jun 10, 2019
Messages
154
Reaction score
1,216
Points
93
Location
Bucharest
Credits
103
Hello @Cunoo, try to install GCC using the command
Code:
cd /usr/ports/lang/gcc48 && make install clean
or
Code:
pkg install gcc48
 

Cunoo

Banned
Banned
Joined
May 9, 2019
Messages
37
Reaction score
103
Points
18
Credits
0
Hello @Cunoo, try to install GCC using the command
Code:
cd /usr/ports/lang/gcc48 && make install clean
or
Code:
pkg install gcc48
Making GCC 4.8.5 for x86_64-portbld-freebsd11.2 [c,c++,objc,fortran]
===> NOTICE:
pgk install gcc++8 work dont have effect
This port is deprecated; you may wish to reconsider installing it:

Unsupported by upstream. Use GCC 7 or newer instead..

===> gcc48-4.8.5_10 has known vulnerabilities:
0 problem(s) in 0 installed package(s) found.
=> Please update your ports tree and try again.
=> Note: Vulnerable ports are marked as such even if there is no update available.
=> If you wish to ignore this vulnerability rebuild with 'make DISABLE_VULNERABILITIES=yes'
*** Error code 1

Stop.
make[1]: stopped in /usr/ports/lang/gcc48
*** Error code 1

Stop.
make: stopped in /usr/ports/lang/gcc48

ports alredy up
but pkg works but dont have any effect same error

but when i use pkg install gcc
its have effect but now i have this look:


Code:
[email protected]:/usr/src/mainline/Srcs/Server/game/src # gmake clean
[email protected]:/usr/src/mainline/Srcs/Server/game/src # gmake
Derleniyor BattleArena.cpp
g++: warning: '-mcpu=' is deprecated; use '-mtune=' or '-march=' instead
In file included from ../../../Extern/include/boost/functional/hash/hash.hpp:49 ,
                 from ../../../Extern/include/boost/functional/hash.hpp:6,
                 from ../../../Extern/include/boost/unordered/unordered_map.hpp:17,
                 from ../../../Extern/include/boost/unordered_map.hpp:16,
                 from char.h:4,
                 from BattleArena.cpp:6:
../../../Extern/include/boost/functional/hash/extensions.hpp:38:33: error: 'template<class T, class A> std::size_t boost::hash_value' redeclared as different kind of entity
   38 |     std::size_t hash_value(std::list<T, A> const& v);
      |                                 ^~~~
In file included from ../../../Extern/include/boost/functional/hash.hpp:6,
                 from ../../../Extern/include/boost/unordered/unordered_map.hpp:17,
                 from ../../../Extern/include/boost/unordered_map.hpp:16,
                 from char.h:4,
                 from BattleArena.cpp:6:
../../../Extern/include/boost/functional/hash/hash.hpp:307:24: note: previous declaration 'std::size_t boost::hash_value(long double)'
  307 |     inline std::size_t hash_value(long double v)
      |                        ^~~~~~~~~~
In file included from ../../../Extern/include/boost/functional/hash/hash.hpp:49 ,
                 from ../../../Extern/include/boost/functional/hash.hpp:6,
                 from ../../../Extern/include/boost/unordered/unordered_map.hpp:17,
                 from ../../../Extern/include/boost/unordered_map.hpp:16,
                 from char.h:4,
                 from BattleArena.cpp:6:
../../../Extern/include/boost/functional/hash/extensions.hpp:38:33: error: reference to 'list' is ambiguous
   38 |     std::size_t hash_value(std::list<T, A> const& v);
      |                                 ^~~~
In file included from /usr/local/lib/gcc9/include/c++/list:63,
                 from stdafx.h:17,
                 from BattleArena.cpp:1:
/usr/local/lib/gcc9/include/c++/bits/stl_list.h:552:11: note: candidates are: 'template<class _Tp, class _Alloc> class std::__cxx11::list'
  552 |     class list : protected _List_base<_Tp, _Alloc>
      |           ^~~~
In file included from ../../../Extern/include/boost/functional/hash/extensions.hpp:17,
                 from ../../../Extern/include/boost/functional/hash/hash.hpp:49 ,
                 from ../../../Extern/include/boost/functional/hash.hpp:6,
                 from ../../../Extern/include/boost/unordered/unordered_map.hpp:17,
                 from ../../../Extern/include/boost/unordered_map.hpp:16,
                 from char.h:4,
                 from BattleArena.cpp:6:
../../../Extern/include/boost/detail/container_fwd.hpp:81:47: note:                 'template<class T, class Allocator> class std::list'
   81 |     template <class T, class Allocator> class list;
      |                                               ^~~~
In file included from ../../../Extern/include/boost/functional/hash/hash.hpp:49 ,
                 from ../../../Extern/include/boost/functional/hash.hpp:6,
                 from ../../../Extern/include/boost/unordered/unordered_map.hpp:17,
                 from ../../../Extern/include/boost/unordered_map.hpp:16,
                 from char.h:4,
                 from BattleArena.cpp:6:
../../../Extern/include/boost/functional/hash/extensions.hpp:38:39: error: expected primary-expression before ',' token
   38 |     std::size_t hash_value(std::list<T, A> const& v);
      |                                       ^
../../../Extern/include/boost/functional/hash/extensions.hpp:38:42: error: expected primary-expression before '>' token
   38 |     std::size_t hash_value(std::list<T, A> const& v);
      |                                          ^
../../../Extern/include/boost/functional/hash/extensions.hpp:38:44: error: expected primary-expression before 'const'
   38 |     std::size_t hash_value(std::list<T, A> const& v);
      |                                            ^~~~~
../../../Extern/include/boost/functional/hash/extensions.hpp:69:33: error: 'template<class T, class A> std::size_t boost::hash_value' redeclared as different kind of entity
   69 |     std::size_t hash_value(std::list<T, A> const& v)
      |                                 ^~~~
In file included from ../../../Extern/include/boost/functional/hash.hpp:6,
                 from ../../../Extern/include/boost/unordered/unordered_map.hpp:17,
                 from ../../../Extern/include/boost/unordered_map.hpp:16,
                 from char.h:4,
                 from BattleArena.cpp:6:
../../../Extern/include/boost/functional/hash/hash.hpp:307:24: note: previous declaration 'std::size_t boost::hash_value(long double)'
  307 |     inline std::size_t hash_value(long double v)
      |                        ^~~~~~~~~~
In file included from ../../../Extern/include/boost/functional/hash/hash.hpp:49 ,
                 from ../../../Extern/include/boost/functional/hash.hpp:6,
                 from ../../../Extern/include/boost/unordered/unordered_map.hpp:17,
                 from ../../../Extern/include/boost/unordered_map.hpp:16,
                 from char.h:4,
                 from BattleArena.cpp:6:
../../../Extern/include/boost/functional/hash/extensions.hpp:69:33: error: reference to 'list' is ambiguous
   69 |     std::size_t hash_value(std::list<T, A> const& v)
      |                                 ^~~~
In file included from /usr/local/lib/gcc9/include/c++/list:63,
                 from stdafx.h:17,
                 from BattleArena.cpp:1:
/usr/local/lib/gcc9/include/c++/bits/stl_list.h:552:11: note: candidates are: 'template<class _Tp, class _Alloc> class std::__cxx11::list'
  552 |     class list : protected _List_base<_Tp, _Alloc>
      |           ^~~~
In file included from ../../../Extern/include/boost/functional/hash/extensions.hpp:17,
                 from ../../../Extern/include/boost/functional/hash/hash.hpp:49 ,
                 from ../../../Extern/include/boost/functional/hash.hpp:6,
                 from ../../../Extern/include/boost/unordered/unordered_map.hpp:17,
                 from ../../../Extern/include/boost/unordered_map.hpp:16,
                 from char.h:4,
                 from BattleArena.cpp:6:
../../../Extern/include/boost/detail/container_fwd.hpp:81:47: note:                 'template<class T, class Allocator> class std::list'
   81 |     template <class T, class Allocator> class list;
      |                                               ^~~~
In file included from ../../../Extern/include/boost/functional/hash/hash.hpp:49 ,
                 from ../../../Extern/include/boost/functional/hash.hpp:6,
                 from ../../../Extern/include/boost/unordered/unordered_map.hpp:17,
                 from ../../../Extern/include/boost/unordered_map.hpp:16,
                 from char.h:4,
                 from BattleArena.cpp:6:
../../../Extern/include/boost/functional/hash/extensions.hpp:69:39: error: expected primary-expression before ',' token
   69 |     std::size_t hash_value(std::list<T, A> const& v)
      |                                       ^
../../../Extern/include/boost/functional/hash/extensions.hpp:69:42: error: expected primary-expression before '>' token
   69 |     std::size_t hash_value(std::list<T, A> const& v)
      |                                          ^
../../../Extern/include/boost/functional/hash/extensions.hpp:69:44: error: expected primary-expression before 'const'
   69 |     std::size_t hash_value(std::list<T, A> const& v)
      |                                            ^~~~~
In file included from /usr/local/lib/gcc9/include/c++/bits/ios_base.h:41,
                 from /usr/local/lib/gcc9/include/c++/ios:42,
                 from /usr/local/lib/gcc9/include/c++/ostream:38,
                 from /usr/local/lib/gcc9/include/c++/iterator:64,
                 from ../../../Extern/include/boost/detail/iterator.hpp:54,
                 from ../../../Extern/include/boost/iterator/iterator_categories.hpp:10,
                 from ../../../Extern/include/boost/unordered/detail/table.hpp:14,
                 from ../../../Extern/include/boost/unordered/detail/equivalent.hpp:10,
                 from ../../../Extern/include/boost/unordered/unordered_map.hpp:19,
                 from ../../../Extern/include/boost/unordered_map.hpp:16,
                 from char.h:4,
                 from BattleArena.cpp:6:
/usr/local/lib/gcc9/include/c++/bits/locale_classes.h:284:24: error: reference to 'basic_string' is ambiguous
  284 |       operator()(const basic_string<_Char, _Traits, _Alloc>& __s1,
      |                        ^~~~~~~~~~~~
In file included from /usr/local/lib/gcc9/include/c++/string:39,
                 from /usr/local/lib/gcc9/include/c++/stdexcept:39,
                 from /usr/local/lib/gcc9/include/c++/array:39,
                 from /usr/local/lib/gcc9/include/c++/tuple:39,
                 from /usr/local/lib/gcc9/include/c++/bits/stl_map.h:63,
                 from /usr/local/lib/gcc9/include/c++/map:61,
                 from stdafx.h:18,
                 from BattleArena.cpp:1:
/usr/local/lib/gcc9/include/c++/bits/stringfwd.h:74:11: note: candidates are: 'template<class _CharT, class _Traits, class _Alloc> class std::__cxx11::basic_string'
   74 |     class basic_string;
      |           ^~~~~~~~~~~~
In file included from ../../../Extern/include/boost/functional/hash/extensions.hpp:17,
                 from ../../../Extern/include/boost/functional/hash/hash.hpp:49 ,
                 from ../../../Extern/include/boost/functional/hash.hpp:6,
                 from ../../../Extern/include/boost/unordered/unordered_map.hpp:17,
                 from ../../../Extern/include/boost/unordered_map.hpp:16,
                 from char.h:4,
                 from BattleArena.cpp:6:
../../../Extern/include/boost/detail/container_fwd.hpp:63:65: note:                 'template<class charT, class traits, class Allocator> class std::basic_string'
   63 |     template <class charT, class traits, class Allocator> class basic_string;
      |                                                                 ^~~~~~~~~~~~
In file included from /usr/local/lib/gcc9/include/c++/bits/ios_base.h:41,
                 from /usr/local/lib/gcc9/include/c++/ios:42,
                 from /usr/local/lib/gcc9/include/c++/ostream:38,
                 from /usr/local/lib/gcc9/include/c++/iterator:64,
                 from ../../../Extern/include/boost/detail/iterator.hpp:54,
                 from ../../../Extern/include/boost/iterator/iterator_categories.hpp:10,
                 from ../../../Extern/include/boost/unordered/detail/table.hpp:14,
                 from ../../../Extern/include/boost/unordered/detail/equivalent.hpp:10,
                 from ../../../Extern/include/boost/unordered/unordered_map.hpp:19,
                 from ../../../Extern/include/boost/unordered_map.hpp:16,
                 from char.h:4,
                 from BattleArena.cpp:6:
/usr/local/lib/gcc9/include/c++/bits/locale_classes.h:284:36: error: expected ' ' or '...' before '<' token
  284 |       operator()(const basic_string<_Char, _Traits, _Alloc>& __s1,
      |                                    ^
In file included from /usr/local/lib/gcc9/include/c++/bits/locale_classes.h:851,
                 from /usr/local/lib/gcc9/include/c++/bits/ios_base.h:41,
                 from /usr/local/lib/gcc9/include/c++/ios:42,
                 from /usr/local/lib/gcc9/include/c++/ostream:38,
                 from /usr/local/lib/gcc9/include/c++/iterator:64,
                 from ../../../Extern/include/boost/detail/iterator.hpp:54,
                 from ../../../Extern/include/boost/iterator/iterator_categories.hpp:10,
                 from ../../../Extern/include/boost/unordered/detail/table.hpp:14,
                 from ../../../Extern/include/boost/unordered/detail/equivalent.hpp:10,
                 from ../../../Extern/include/boost/unordered/unordered_map.hpp:19,
                 from ../../../Extern/include/boost/unordered_map.hpp:16,
                 from char.h:4,
                 from BattleArena.cpp:6:
/usr/local/lib/gcc9/include/c++/bits/locale_classes.tcc:81:22: error: reference to 'basic_string' is ambiguous
   81 |     operator()(const basic_string<_CharT, _Traits, _Alloc>& __s1,
      |                      ^~~~~~~~~~~~
In file included from /usr/local/lib/gcc9/include/c++/string:39,
                 from /usr/local/lib/gcc9/include/c++/stdexcept:39,
                 from /usr/local/lib/gcc9/include/c++/array:39,
                 from /usr/local/lib/gcc9/include/c++/tuple:39,
                 from /usr/local/lib/gcc9/include/c++/bits/stl_map.h:63,
                 from /usr/local/lib/gcc9/include/c++/map:61,
                 from stdafx.h:18,
                 from BattleArena.cpp:1:
/usr/local/lib/gcc9/include/c++/bits/stringfwd.h:74:11: note: candidates are: 'template<class _CharT, class _Traits, class _Alloc> class std::__cxx11::basic_string'
   74 |     class basic_string;
      |           ^~~~~~~~~~~~
In file included from ../../../Extern/include/boost/functional/hash/extensions.hpp:17,
                 from ../../../Extern/include/boost/functional/hash/hash.hpp:49 ,
                 from ../../../Extern/include/boost/functional/hash.hpp:6,
                 from ../../../Extern/include/boost/unordered/unordered_map.hpp:17,
                 from ../../../Extern/include/boost/unordered_map.hpp:16,
                 from char.h:4,
                 from BattleArena.cpp:6:
../../../Extern/include/boost/detail/container_fwd.hpp:63:65: note:                 'template<class charT, class traits, class Allocator> class std::basic_string'
   63 |     template <class charT, class traits, class Allocator> class basic_string;
      |                                                                 ^~~~~~~~~~~~
In file included from /usr/local/lib/gcc9/include/c++/bits/locale_classes.h:851,
                 from /usr/local/lib/gcc9/include/c++/bits/ios_base.h:41,
                 from /usr/local/lib/gcc9/include/c++/ios:42,
                 from /usr/local/lib/gcc9/include/c++/ostream:38,
                 from /usr/local/lib/gcc9/include/c++/iterator:64,
                 from ../../../Extern/include/boost/detail/iterator.hpp:54,
                 from ../../../Extern/include/boost/iterator/iterator_categories.hpp:10,
                 from ../../../Extern/include/boost/unordered/detail/table.hpp:14,
                 from ../../../Extern/include/boost/unordered/detail/equivalent.hpp:10,
                 from ../../../Extern/include/boost/unordered/unordered_map.hpp:19,
                 from ../../../Extern/include/boost/unordered_map.hpp:16,
                 from char.h:4,
                 from BattleArena.cpp:6:
/usr/local/lib/gcc9/include/c++/bits/locale_classes.tcc:81:34: error: expected  ,' or '...' before '<' token
   81 |     operator()(const basic_string<_CharT, _Traits, _Alloc>& __s1,
      |                                  ^
/usr/local/lib/gcc9/include/c++/bits/locale_classes.tcc: In member function 'bool std::locale::operator()(int) const':
/usr/local/lib/gcc9/include/c++/bits/locale_classes.tcc:86:33: error: '__s1' was not declared in this scope
   86 |       return (__collate.compare(__s1.data(), __s1.data() + __s1.length(),
      |                                 ^~~~
/usr/local/lib/gcc9/include/c++/bits/locale_classes.tcc:87:5: error: '__s2' was not declared in this scope
   87 |     __s2.data(), __s2.data() + __s2.length()) < 0);
      |     ^~~~
In file included from /usr/local/lib/gcc9/include/c++/ios:43,
                 from /usr/local/lib/gcc9/include/c++/ostream:38,
                 from /usr/local/lib/gcc9/include/c++/iterator:64,
                 from ../../../Extern/include/boost/detail/iterator.hpp:54,
                 from ../../../Extern/include/boost/iterator/iterator_categories.hpp:10,
                 from ../../../Extern/include/boost/unordered/detail/table.hpp:14,
                 from ../../../Extern/include/boost/unordered/detail/equivalent.hpp:10,
                 from ../../../Extern/include/boost/unordered/unordered_map.hpp:19,
                 from ../../../Extern/include/boost/unordered_map.hpp:16,
                 from char.h:4,
                 from BattleArena.cpp:6:
/usr/local/lib/gcc9/include/c++/streambuf: At global scope:
/usr/local/lib/gcc9/include/c++/streambuf:176:6: error: reference to 'basic_string' is ambiguous
  176 |      basic_string<_CharT2, _Traits2, _Alloc>&);
      |      ^~~~~~~~~~~~
In file included from /usr/local/lib/gcc9/include/c++/string:39,
                 from /usr/local/lib/gcc9/include/c++/stdexcept:39,
                 from /usr/local/lib/gcc9/include/c++/array:39,
                 from /usr/local/lib/gcc9/include/c++/tuple:39,
                 from /usr/local/lib/gcc9/include/c++/bits/stl_map.h:63,
                 from /usr/local/lib/gcc9/include/c++/map:61,
                 from stdafx.h:18,
                 from BattleArena.cpp:1:
/usr/local/lib/gcc9/include/c++/bits/stringfwd.h:74:11: note: candidates are: 'template<class _CharT, class _Traits, class _Alloc> class std::__cxx11::basic_string'
   74 |     class basic_string;
      |           ^~~~~~~~~~~~
In file included from ../../../Extern/include/boost/functional/hash/extensions.hpp:17,
                 from ../../../Extern/include/boost/functional/hash/hash.hpp:49 ,
                 from ../../../Extern/include/boost/functional/hash.hpp:6,
                 from ../../../Extern/include/boost/unordered/unordered_map.hpp:17,
                 from ../../../Extern/include/boost/unordered_map.hpp:16,
                 from char.h:4,
                 from BattleArena.cpp:6:
../../../Extern/include/boost/detail/container_fwd.hpp:63:65: note:                 'template<class charT, class traits, class Allocator> class std::basic_string'
   63 |     template <class charT, class traits, class Allocator> class basic_string;
      |                                                                 ^~~~~~~~~~~~
In file included from /usr/local/lib/gcc9/include/c++/ios:43,
                 from /usr/local/lib/gcc9/include/c++/ostream:38,
                 from /usr/local/lib/gcc9/include/c++/iterator:64,
                 from ../../../Extern/include/boost/detail/iterator.hpp:54,
                 from ../../../Extern/include/boost/iterator/iterator_categories.hpp:10,
                 from ../../../Extern/include/boost/unordered/detail/table.hpp:14,
                 from ../../../Extern/include/boost/unordered/detail/equivalent.hpp:10,
                 from ../../../Extern/include/boost/unordered/unordered_map.hpp:19,
                 from ../../../Extern/include/boost/unordered_map.hpp:16,
                 from char.h:4,
                 from BattleArena.cpp:6:
/usr/local/lib/gcc9/include/c++/streambuf:176:6: error: 'basic_string' has not been declared
  176 |      basic_string<_CharT2, _Traits2, _Alloc>&);
      |      ^~~~~~~~~~~~
/usr/local/lib/gcc9/include/c++/streambuf:176:18: error: expected ',' or '...' before '<' token
  176 |      basic_string<_CharT2, _Traits2, _Alloc>&);
      |                  ^
/usr/local/lib/gcc9/include/c++/streambuf:181:3: error: reference to 'basic_string' is ambiguous
  181 |   basic_string<_CharT2, _Traits2, _Alloc>&, _CharT2);
      |   ^~~~~~~~~~~~
In file included from /usr/local/lib/gcc9/include/c++/string:39,
                 from /usr/local/lib/gcc9/include/c++/stdexcept:39,
                 from /usr/local/lib/gcc9/include/c++/array:39,
                 from /usr/local/lib/gcc9/include/c++/tuple:39,
                 from /usr/local/lib/gcc9/include/c++/bits/stl_map.h:63,
                 from /usr/local/lib/gcc9/include/c++/map:61,
                 from stdafx.h:18,
                 from BattleArena.cpp:1:
/usr/local/lib/gcc9/include/c++/bits/stringfwd.h:74:11: note: candidates are: 'template<class _CharT, class _Traits, class _Alloc> class std::__cxx11::basic_string'
   74 |     class basic_string;
      |           ^~~~~~~~~~~~
In file included from ../../../Extern/include/boost/functional/hash/extensions.hpp:17,
                 from ../../../Extern/include/boost/functional/hash/hash.hpp:49 ,
                 from ../../../Extern/include/boost/functional/hash.hpp:6,
                 from ../../../Extern/include/boost/unordered/unordered_map.hpp:17,
                 from ../../../Extern/include/boost/unordered_map.hpp:16,
                 from char.h:4,
                 from BattleArena.cpp:6:
../../../Extern/include/boost/detail/container_fwd.hpp:63:65: note:                 'template<class charT, class traits, class Allocator> class std::basic_string'
   63 |     template <class charT, class traits, class Allocator> class basic_string;
      |                                                                 ^~~~~~~~~~~~
In file included from /usr/local/lib/gcc9/include/c++/ios:43,
                 from /usr/local/lib/gcc9/include/c++/ostream:38,
                 from /usr/local/lib/gcc9/include/c++/iterator:64,
                 from ../../../Extern/include/boost/detail/iterator.hpp:54,
                 from ../../../Extern/include/boost/iterator/iterator_categories.hpp:10,
                 from ../../../Extern/include/boost/unordered/detail/table.hpp:14,
                 from ../../../Extern/include/boost/unordered/detail/equivalent.hpp:10,
                 from ../../../Extern/include/boost/unordered/unordered_map.hpp:19,
                 from ../../../Extern/include/boost/unordered_map.hpp:16,
                 from char.h:4,
                 from BattleArena.cpp:6:
/usr/local/lib/gcc9/include/c++/streambuf:181:3: error: 'basic_string' has not been declared
  181 |   basic_string<_CharT2, _Traits2, _Alloc>&, _CharT2);
      |   ^~~~~~~~~~~~
/usr/local/lib/gcc9/include/c++/streambuf:181:15: error: expected ',' or '...' before '<' token
  181 |   basic_string<_CharT2, _Traits2, _Alloc>&, _CharT2);
      |               ^
In file included from /usr/local/lib/gcc9/include/c++/bits/locale_facets.h:2655,
                 from /usr/local/lib/gcc9/include/c++/bits/basic_ios.h:37,
                 from /usr/local/lib/gcc9/include/c++/ios:44,
                 from /usr/local/lib/gcc9/include/c++/ostream:38,
                 from /usr/local/lib/gcc9/include/c++/iterator:64,
                 from ../../../Extern/include/boost/detail/iterator.hpp:54,
                 from ../../../Extern/include/boost/iterator/iterator_categories.hpp:10,
                 from ../../../Extern/include/boost/unordered/detail/table.hpp:14,
                 from ../../../Extern/include/boost/unordered/detail/equivalent.hpp:10,
                 from ../../../Extern/include/boost/unordered/unordered_map.hpp:19,
                 from ../../../Extern/include/boost/unordered_map.hpp:16,
                 from char.h:4,
                 from BattleArena.cpp:6:
/usr/local/lib/gcc9/include/c++/bits/locale_facets.tcc: In member function 'void std::__numpunct_cache<_CharT>::_M_cache(const std::locale&)':
/usr/local/lib/gcc9/include/c++/bits/locale_facets.tcc:96:10: error: reference to 'basic_string' is ambiguous
   96 |    const basic_string<_CharT>& __tn = __np.truename();
      |          ^~~~~~~~~~~~
In file included from /usr/local/lib/gcc9/include/c++/string:39,
                 from /usr/local/lib/gcc9/include/c++/stdexcept:39,
                 from /usr/local/lib/gcc9/include/c++/array:39,
                 from /usr/local/lib/gcc9/include/c++/tuple:39,
                 from /usr/local/lib/gcc9/include/c++/bits/stl_map.h:63,
                 from /usr/local/lib/gcc9/include/c++/map:61,
                 from stdafx.h:18,
                 from BattleArena.cpp:1:
/usr/local/lib/gcc9/include/c++/bits/stringfwd.h:74:11: note: candidates are: 'template<class _CharT, class _Traits, class _Alloc> class std::__cxx11::basic_string'
   74 |     class basic_string;
      |           ^~~~~~~~~~~~
In file included from ../../../Extern/include/boost/functional/hash/extensions.hpp:17,
                 from ../../../Extern/include/boost/functional/hash/hash.hpp:49 ,
                 from ../../../Extern/include/boost/functional/hash.hpp:6,
                 from ../../../Extern/include/boost/unordered/unordered_map.hpp:17,
                 from ../../../Extern/include/boost/unordered_map.hpp:16,
                 from char.h:4,
                 from BattleArena.cpp:6:
../../../Extern/include/boost/detail/container_fwd.hpp:63:65: note:                 'template<class charT, class traits, class Allocator> class std::basic_string'
   63 |     template <class charT, class traits, class Allocator> class basic_string;
      |                                                                 ^~~~~~~~~~~~
In file included from /usr/local/lib/gcc9/include/c++/bits/locale_facets.h:2655,
                 from /usr/local/lib/gcc9/include/c++/bits/basic_ios.h:37,
                 from /usr/local/lib/gcc9/include/c++/ios:44,
                 from /usr/local/lib/gcc9/include/c++/ostream:38,
                 from /usr/local/lib/gcc9/include/c++/iterator:64,
                 from ../../../Extern/include/boost/detail/iterator.hpp:54,
                 from ../../../Extern/include/boost/iterator/iterator_categories.hpp:10,
                 from ../../../Extern/include/boost/unordered/detail/table.hpp:14,
                 from ../../../Extern/include/boost/unordered/detail/equivalent.hpp:10,
                 from ../../../Extern/include/boost/unordered/unordered_map.hpp:19,
                 from ../../../Extern/include/boost/unordered_map.hpp:16,
                 from char.h:4,
                 from BattleArena.cpp:6:
/usr/local/lib/gcc9/include/c++/bits/locale_facets.tcc:97:23: error: '__tn' was not declared in this scope
   97 |    _M_truename_size = __tn.size();
      |                       ^~~~
/usr/local/lib/gcc9/include/c++/bits/locale_facets.tcc:101:10: error: reference to 'basic_string' is ambiguous
  101 |    const basic_string<_CharT>& __fn = __np.falsename();
      |          ^~~~~~~~~~~~
In file included from /usr/local/lib/gcc9/include/c++/string:39,
                 from /usr/local/lib/gcc9/include/c++/stdexcept:39,
                 from /usr/local/lib/gcc9/include/c++/array:39,
                 from /usr/local/lib/gcc9/include/c++/tuple:39,
                 from /usr/local/lib/gcc9/include/c++/bits/stl_map.h:63,
                 from /usr/local/lib/gcc9/include/c++/map:61,
                 from stdafx.h:18,
                 from BattleArena.cpp:1:
/usr/local/lib/gcc9/include/c++/bits/stringfwd.h:74:11: note: candidates are: 'template<class _CharT, class _Traits, class _Alloc> class std::__cxx11::basic_string'
   74 |     class basic_string;
      |           ^~~~~~~~~~~~
In file included from ../../../Extern/include/boost/functional/hash/extensions.hpp:17,
                 from ../../../Extern/include/boost/functional/hash/hash.hpp:49 ,
                 from ../../../Extern/include/boost/functional/hash.hpp:6,
                 from ../../../Extern/include/boost/unordered/unordered_map.hpp:17,
                 from ../../../Extern/include/boost/unordered_map.hpp:16,
                 from char.h:4,
                 from BattleArena.cpp:6:
../../../Extern/include/boost/detail/container_fwd.hpp:63:65: note:                 'template<class charT, class traits, class Allocator> class std::basic_string'
   63 |     template <class charT, class traits, class Allocator> class basic_string;
      |                                                                 ^~~~~~~~~~~~
In file included from /usr/local/lib/gcc9/include/c++/bits/locale_facets.h:2655,
                 from /usr/local/lib/gcc9/include/c++/bits/basic_ios.h:37,
                 from /usr/local/lib/gcc9/include/c++/ios:44,
                 from /usr/local/lib/gcc9/include/c++/ostream:38,
                 from /usr/local/lib/gcc9/include/c++/iterator:64,
                 from ../../../Extern/include/boost/detail/iterator.hpp:54,
                 from ../../../Extern/include/boost/iterator/iterator_categories.hpp:10,
                 from ../../../Extern/include/boost/unordered/detail/table.hpp:14,
                 from ../../../Extern/include/boost/unordered/detail/equivalent.hpp:10,
                 from ../../../Extern/include/boost/unordered/unordered_map.hpp:19,
                 from ../../../Extern/include/boost/unordered_map.hpp:16,
                 from char.h:4,
                 from BattleArena.cpp:6:
/usr/local/lib/gcc9/include/c++/bits/locale_facets.tcc:102:24: error: '__fn' was not declared in this scope
  102 |    _M_falsename_size = __fn.size();
      |                        ^~~~
In file included from BattleArena.cpp:6:
char.h: At global scope:
char.h:944:9: error: reference to 'list' is ambiguous
  944 |   const std::list<CAffect *> & GetAffectContainer() const { return m_list_pkAffect; }
      |         ^~~
In file included from /usr/local/lib/gcc9/include/c++/list:63,
                 from stdafx.h:17,
                 from BattleArena.cpp:1:
/usr/local/lib/gcc9/include/c++/bits/stl_list.h:552:11: note: candidates are: 'template<class _Tp, class _Alloc> class std::__cxx11::list'
  552 |     class list : protected _List_base<_Tp, _Alloc>
      |           ^~~~
In file included from ../../../Extern/include/boost/functional/hash/extensions.hpp:17,
                 from ../../../Extern/include/boost/functional/hash/hash.hpp:49 ,
                 from ../../../Extern/include/boost/functional/hash.hpp:6,
                 from ../../../Extern/include/boost/unordered/unordered_map.hpp:17,
                 from ../../../Extern/include/boost/unordered_map.hpp:16,
                 from char.h:4,
                 from BattleArena.cpp:6:
../../../Extern/include/boost/detail/container_fwd.hpp:81:47: note:                 'template<class T, class Allocator> class std::list'
   81 |     template <class T, class Allocator> class list;
      |                                               ^~~~
In file included from BattleArena.cpp:6:
char.h:950:3: error: reference to 'list' is ambiguous
  950 |   std::list<CAffect *> m_list_pkAffect;
      |   ^~~
In file included from /usr/local/lib/gcc9/include/c++/list:63,
                 from stdafx.h:17,
                 from BattleArena.cpp:1:
/usr/local/lib/gcc9/include/c++/bits/stl_list.h:552:11: note: candidates are: 'template<class _Tp, class _Alloc> class std::__cxx11::list'
  552 |     class list : protected _List_base<_Tp, _Alloc>
      |           ^~~~
In file included from ../../../Extern/include/boost/functional/hash/extensions.hpp:17,
                 from ../../../Extern/include/boost/functional/hash/hash.hpp:49 ,
                 from ../../../Extern/include/boost/functional/hash.hpp:6,
                 from ../../../Extern/include/boost/unordered/unordered_map.hpp:17,
                 from ../../../Extern/include/boost/unordered_map.hpp:16,
                 from char.h:4,
                 from BattleArena.cpp:6:
../../../Extern/include/boost/detail/container_fwd.hpp:81:47: note:                 'template<class T, class Allocator> class std::list'
   81 |     template <class T, class Allocator> class list;
      |                                               ^~~~
gmake: *** [Makefile:129: OBJDIR/BattleArena.o] Error 1
[email protected]:/usr/src/mainline/Srcs/Server/game/src # gmake -j2
Derleniyor BattleArena.cpp
Derleniyor FSM.cpp
g++: warning: '-mcpu=' is deprecated; use '-mtune=' or '-march=' instead
g++: warning: '-mcpu=' is deprecated; use '-mtune=' or '-march=' instead
Derleniyor MarkConvert.cpp
g++: warning: '-mcpu=' is deprecated; use '-mtune=' or '-march=' instead
In file included from ../../../Extern/include/boost/functional/hash/hash.hpp:49 ,
                 from ../../../Extern/include/boost/functional/hash.hpp:6,
                 from ../../../Extern/include/boost/unordered/unordered_map.hpp:17,
                 from ../../../Extern/include/boost/unordered_map.hpp:16,
                 from char.h:4,
                 from BattleArena.cpp:6:
../../../Extern/include/boost/functional/hash/extensions.hpp:38:33: error: 'template<class T, class A> std::size_t boost::hash_value' redeclared as different kind of entity
   38 |     std::size_t hash_value(std::list<T, A> const& v);
      |                                 ^~~~
In file included from ../../../Extern/include/boost/functional/hash.hpp:6,
                 from ../../../Extern/include/boost/unordered/unordered_map.hpp:17,
                 from ../../../Extern/include/boost/unordered_map.hpp:16,
                 from char.h:4,
                 from BattleArena.cpp:6:
../../../Extern/include/boost/functional/hash/hash.hpp:307:24: note: previous declaration 'std::size_t boost::hash_value(long double)'
  307 |     inline std::size_t hash_value(long double v)
      |                        ^~~~~~~~~~
In file included from ../../../Extern/include/boost/functional/hash/hash.hpp:49 ,
                 from ../../../Extern/include/boost/functional/hash.hpp:6,
                 from ../../../Extern/include/boost/unordered/unordered_map.hpp:17,
                 from ../../../Extern/include/boost/unordered_map.hpp:16,
                 from char.h:4,
                 from BattleArena.cpp:6:
../../../Extern/include/boost/functional/hash/extensions.hpp:38:33: error: reference to 'list' is ambiguous
   38 |     std::size_t hash_value(std::list<T, A> const& v);
      |                                 ^~~~
In file included from /usr/local/lib/gcc9/include/c++/list:63,
                 from stdafx.h:17,
                 from BattleArena.cpp:1:
/usr/local/lib/gcc9/include/c++/bits/stl_list.h:552:11: note: candidates are: 'template<class _Tp, class _Alloc> class std::__cxx11::list'
  552 |     class list : protected _List_base<_Tp, _Alloc>
      |           ^~~~
In file included from ../../../Extern/include/boost/functional/hash/extensions.hpp:17,
                 from ../../../Extern/include/boost/functional/hash/hash.hpp:49 ,
                 from ../../../Extern/include/boost/functional/hash.hpp:6,
                 from ../../../Extern/include/boost/unordered/unordered_map.hpp:17,
                 from ../../../Extern/include/boost/unordered_map.hpp:16,
                 from char.h:4,
                 from BattleArena.cpp:6:
../../../Extern/include/boost/detail/container_fwd.hpp:81:47: note:                 'template<class T, class Allocator> class std::list'
   81 |     template <class T, class Allocator> class list;
      |                                               ^~~~
In file included from ../../../Extern/include/boost/functional/hash/hash.hpp:49 ,
                 from ../../../Extern/include/boost/functional/hash.hpp:6,
                 from ../../../Extern/include/boost/unordered/unordered_map.hpp:17,
                 from ../../../Extern/include/boost/unordered_map.hpp:16,
                 from char.h:4,
                 from BattleArena.cpp:6:
../../../Extern/include/boost/functional/hash/extensions.hpp:38:39: error: expected primary-expression before ',' token
   38 |     std::size_t hash_value(std::list<T, A> const& v);
      |                                       ^
../../../Extern/include/boost/functional/hash/extensions.hpp:38:42: error: expected primary-expression before '>' token
   38 |     std::size_t hash_value(std::list<T, A> const& v);
      |                                          ^
../../../Extern/include/boost/functional/hash/extensions.hpp:38:44: error: expected primary-expression before 'const'
   38 |     std::size_t hash_value(std::list<T, A> const& v);
      |                                            ^~~~~
../../../Extern/include/boost/functional/hash/extensions.hpp:69:33: error: 'template<class T, class A> std::size_t boost::hash_value' redeclared as different kind of entity
   69 |     std::size_t hash_value(std::list<T, A> const& v)
      |                                 ^~~~
In file included from ../../../Extern/include/boost/functional/hash.hpp:6,
                 from ../../../Extern/include/boost/unordered/unordered_map.hpp:17,
                 from ../../../Extern/include/boost/unordered_map.hpp:16,
                 from char.h:4,
                 from BattleArena.cpp:6:
../../../Extern/include/boost/functional/hash/hash.hpp:307:24: note: previous declaration 'std::size_t boost::hash_value(long double)'
  307 |     inline std::size_t hash_value(long double v)
      |                        ^~~~~~~~~~
In file included from ../../../Extern/include/boost/functional/hash/hash.hpp:49 ,
                 from ../../../Extern/include/boost/functional/hash.hpp:6,
                 from ../../../Extern/include/boost/unordered/unordered_map.hpp:17,
                 from ../../../Extern/include/boost/unordered_map.hpp:16,
                 from char.h:4,
                 from BattleArena.cpp:6:
../../../Extern/include/boost/functional/hash/extensions.hpp:69:33: error: reference to 'list' is ambiguous
   69 |     std::size_t hash_value(std::list<T, A> const& v)
      |                                 ^~~~
In file included from /usr/local/lib/gcc9/include/c++/list:63,
                 from stdafx.h:17,
                 from BattleArena.cpp:1:
/usr/local/lib/gcc9/include/c++/bits/stl_list.h:552:11: note: candidates are: 'template<class _Tp, class _Alloc> class std::__cxx11::list'
  552 |     class list : protected _List_base<_Tp, _Alloc>
      |           ^~~~
In file included from ../../../Extern/include/boost/functional/hash/extensions.hpp:17,
                 from ../../../Extern/include/boost/functional/hash/hash.hpp:49 ,
                 from ../../../Extern/include/boost/functional/hash.hpp:6,
                 from ../../../Extern/include/boost/unordered/unordered_map.hpp:17,
                 from ../../../Extern/include/boost/unordered_map.hpp:16,
                 from char.h:4,
                 from BattleArena.cpp:6:
../../../Extern/include/boost/detail/container_fwd.hpp:81:47: note:                 'template<class T, class Allocator> class std::list'
   81 |     template <class T, class Allocator> class list;
      |                                               ^~~~
In file included from ../../../Extern/include/boost/functional/hash/hash.hpp:49 ,
                 from ../../../Extern/include/boost/functional/hash.hpp:6,
                 from ../../../Extern/include/boost/unordered/unordered_map.hpp:17,
                 from ../../../Extern/include/boost/unordered_map.hpp:16,
                 from char.h:4,
                 from BattleArena.cpp:6:
../../../Extern/include/boost/functional/hash/extensions.hpp:69:39: error: expected primary-expression before ',' token
   69 |     std::size_t hash_value(std::list<T, A> const& v)
      |                                       ^
../../../Extern/include/boost/functional/hash/extensions.hpp:69:42: error: expected primary-expression before '>' token
   69 |     std::size_t hash_value(std::list<T, A> const& v)
      |                                          ^
../../../Extern/include/boost/functional/hash/extensions.hpp:69:44: error: expected primary-expression before 'const'
   69 |     std::size_t hash_value(std::list<T, A> const& v)
      |                                            ^~~~~
In file included from /usr/local/lib/gcc9/include/c++/bits/ios_base.h:41,
                 from /usr/local/lib/gcc9/include/c++/ios:42,
                 from /usr/local/lib/gcc9/include/c++/ostream:38,
                 from /usr/local/lib/gcc9/include/c++/iterator:64,
                 from ../../../Extern/include/boost/detail/iterator.hpp:54,
                 from ../../../Extern/include/boost/iterator/iterator_categories.hpp:10,
                 from ../../../Extern/include/boost/unordered/detail/table.hpp:14,
                 from ../../../Extern/include/boost/unordered/detail/equivalent.hpp:10,
                 from ../../../Extern/include/boost/unordered/unordered_map.hpp:19,
                 from ../../../Extern/include/boost/unordered_map.hpp:16,
                 from char.h:4,
                 from BattleArena.cpp:6:
/usr/local/lib/gcc9/include/c++/bits/locale_classes.h:284:24: error: reference to 'basic_string' is ambiguous
  284 |       operator()(const basic_string<_Char, _Traits, _Alloc>& __s1,
      |                        ^~~~~~~~~~~~
In file included from /usr/local/lib/gcc9/include/c++/string:39,
                 from /usr/local/lib/gcc9/include/c++/stdexcept:39,
                 from /usr/local/lib/gcc9/include/c++/array:39,
                 from /usr/local/lib/gcc9/include/c++/tuple:39,
                 from /usr/local/lib/gcc9/include/c++/bits/stl_map.h:63,
                 from /usr/local/lib/gcc9/include/c++/map:61,
                 from stdafx.h:18,
                 from BattleArena.cpp:1:
/usr/local/lib/gcc9/include/c++/bits/stringfwd.h:74:11: note: candidates are: 'template<class _CharT, class _Traits, class _Alloc> class std::__cxx11::basic_string'
   74 |     class basic_string;
      |           ^~~~~~~~~~~~
In file included from ../../../Extern/include/boost/functional/hash/extensions.hpp:17,
                 from ../../../Extern/include/boost/functional/hash/hash.hpp:49 ,
                 from ../../../Extern/include/boost/functional/hash.hpp:6,
                 from ../../../Extern/include/boost/unordered/unordered_map.hpp:17,
                 from ../../../Extern/include/boost/unordered_map.hpp:16,
                 from char.h:4,
                 from BattleArena.cpp:6:
../../../Extern/include/boost/detail/container_fwd.hpp:63:65: note:                 'template<class charT, class traits, class Allocator> class std::basic_string'
   63 |     template <class charT, class traits, class Allocator> class basic_string;
      |                                                                 ^~~~~~~~~~~~
In file included from /usr/local/lib/gcc9/include/c++/bits/ios_base.h:41,
                 from /usr/local/lib/gcc9/include/c++/ios:42,
                 from /usr/local/lib/gcc9/include/c++/ostream:38,
                 from /usr/local/lib/gcc9/include/c++/iterator:64,
                 from ../../../Extern/include/boost/detail/iterator.hpp:54,
                 from ../../../Extern/include/boost/iterator/iterator_categories.hpp:10,
                 from ../../../Extern/include/boost/unordered/detail/table.hpp:14,
                 from ../../../Extern/include/boost/unordered/detail/equivalent.hpp:10,
                 from ../../../Extern/include/boost/unordered/unordered_map.hpp:19,
                 from ../../../Extern/include/boost/unordered_map.hpp:16,
                 from char.h:4,
                 from BattleArena.cpp:6:
/usr/local/lib/gcc9/include/c++/bits/locale_classes.h:284:36: error: expected ' ' or '...' before '<' token
  284 |       operator()(const basic_string<_Char, _Traits, _Alloc>& __s1,
      |                                    ^
In file included from /usr/local/lib/gcc9/include/c++/bits/locale_classes.h:851,
                 from /usr/local/lib/gcc9/include/c++/bits/ios_base.h:41,
                 from /usr/local/lib/gcc9/include/c++/ios:42,
                 from /usr/local/lib/gcc9/include/c++/ostream:38,
                 from /usr/local/lib/gcc9/include/c++/iterator:64,
                 from ../../../Extern/include/boost/detail/iterator.hpp:54,
                 from ../../../Extern/include/boost/iterator/iterator_categories.hpp:10,
                 from ../../../Extern/include/boost/unordered/detail/table.hpp:14,
                 from ../../../Extern/include/boost/unordered/detail/equivalent.hpp:10,
                 from ../../../Extern/include/boost/unordered/unordered_map.hpp:19,
                 from ../../../Extern/include/boost/unordered_map.hpp:16,
                 from char.h:4,
                 from BattleArena.cpp:6:
/usr/local/lib/gcc9/include/c++/bits/locale_classes.tcc:81:22: error: reference to 'basic_string' is ambiguous
   81 |     operator()(const basic_string<_CharT, _Traits, _Alloc>& __s1,
      |                      ^~~~~~~~~~~~
In file included from /usr/local/lib/gcc9/include/c++/string:39,
                 from /usr/local/lib/gcc9/include/c++/stdexcept:39,
                 from /usr/local/lib/gcc9/include/c++/array:39,
                 from /usr/local/lib/gcc9/include/c++/tuple:39,
                 from /usr/local/lib/gcc9/include/c++/bits/stl_map.h:63,
                 from /usr/local/lib/gcc9/include/c++/map:61,
                 from stdafx.h:18,
                 from BattleArena.cpp:1:
/usr/local/lib/gcc9/include/c++/bits/stringfwd.h:74:11: note: candidates are: 'template<class _CharT, class _Traits, class _Alloc> class std::__cxx11::basic_string'
   74 |     class basic_string;
      |           ^~~~~~~~~~~~
In file included from ../../../Extern/include/boost/functional/hash/extensions.hpp:17,
                 from ../../../Extern/include/boost/functional/hash/hash.hpp:49 ,
                 from ../../../Extern/include/boost/functional/hash.hpp:6,
                 from ../../../Extern/include/boost/unordered/unordered_map.hpp:17,
                 from ../../../Extern/include/boost/unordered_map.hpp:16,
                 from char.h:4,
                 from BattleArena.cpp:6:
../../../Extern/include/boost/detail/container_fwd.hpp:63:65: note:                 'template<class charT, class traits, class Allocator> class std::basic_string'
   63 |     template <class charT, class traits, class Allocator> class basic_string;
      |                                                                 ^~~~~~~~~~~~
In file included from /usr/local/lib/gcc9/include/c++/bits/locale_classes.h:851,
                 from /usr/local/lib/gcc9/include/c++/bits/ios_base.h:41,
                 from /usr/local/lib/gcc9/include/c++/ios:42,
                 from /usr/local/lib/gcc9/include/c++/ostream:38,
                 from /usr/local/lib/gcc9/include/c++/iterator:64,
                 from ../../../Extern/include/boost/detail/iterator.hpp:54,
                 from ../../../Extern/include/boost/iterator/iterator_categories.hpp:10,
                 from ../../../Extern/include/boost/unordered/detail/table.hpp:14,
                 from ../../../Extern/include/boost/unordered/detail/equivalent.hpp:10,
                 from ../../../Extern/include/boost/unordered/unordered_map.hpp:19,
                 from ../../../Extern/include/boost/unordered_map.hpp:16,
                 from char.h:4,
                 from BattleArena.cpp:6:
/usr/local/lib/gcc9/include/c++/bits/locale_classes.tcc:81:34: error: expected  ,' or '...' before '<' token
   81 |     operator()(const basic_string<_CharT, _Traits, _Alloc>& __s1,
      |                                  ^
/usr/local/lib/gcc9/include/c++/bits/locale_classes.tcc: In member function 'bool std::locale::operator()(int) const':
/usr/local/lib/gcc9/include/c++/bits/locale_classes.tcc:86:33: error: '__s1' was not declared in this scope
   86 |       return (__collate.compare(__s1.data(), __s1.data() + __s1.length(),
      |                                 ^~~~
/usr/local/lib/gcc9/include/c++/bits/locale_classes.tcc:87:5: error: '__s2' was not declared in this scope
   87 |     __s2.data(), __s2.data() + __s2.length()) < 0);
      |     ^~~~
Derleniyor MarkImage.cpp
g++: warning: '-mcpu=' is deprecated; use '-mtune=' or '-march=' instead
In file included from /usr/local/lib/gcc9/include/c++/ios:43,
                 from /usr/local/lib/gcc9/include/c++/ostream:38,
                 from /usr/local/lib/gcc9/include/c++/iterator:64,
                 from ../../../Extern/include/boost/detail/iterator.hpp:54,
                 from ../../../Extern/include/boost/iterator/iterator_categories.hpp:10,
                 from ../../../Extern/include/boost/unordered/detail/table.hpp:14,
                 from ../../../Extern/include/boost/unordered/detail/equivalent.hpp:10,
                 from ../../../Extern/include/boost/unordered/unordered_map.hpp:19,
                 from ../../../Extern/include/boost/unordered_map.hpp:16,
                 from char.h:4,
                 from BattleArena.cpp:6:
/usr/local/lib/gcc9/include/c++/streambuf: At global scope:
/usr/local/lib/gcc9/include/c++/streambuf:176:6: error: reference to 'basic_string' is ambiguous
  176 |      basic_string<_CharT2, _Traits2, _Alloc>&);
      |      ^~~~~~~~~~~~
In file included from /usr/local/lib/gcc9/include/c++/string:39,
                 from /usr/local/lib/gcc9/include/c++/stdexcept:39,
                 from /usr/local/lib/gcc9/include/c++/array:39,
                 from /usr/local/lib/gcc9/include/c++/tuple:39,
                 from /usr/local/lib/gcc9/include/c++/bits/stl_map.h:63,
                 from /usr/local/lib/gcc9/include/c++/map:61,
                 from stdafx.h:18,
                 from BattleArena.cpp:1:
/usr/local/lib/gcc9/include/c++/bits/stringfwd.h:74:11: note: candidates are: 'template<class _CharT, class _Traits, class _Alloc> class std::__cxx11::basic_string'
   74 |     class basic_string;
      |           ^~~~~~~~~~~~
In file included from ../../../Extern/include/boost/functional/hash/extensions.hpp:17,
                 from ../../../Extern/include/boost/functional/hash/hash.hpp:49 ,
                 from ../../../Extern/include/boost/functional/hash.hpp:6,
                 from ../../../Extern/include/boost/unordered/unordered_map.hpp:17,
                 from ../../../Extern/include/boost/unordered_map.hpp:16,
                 from char.h:4,
                 from BattleArena.cpp:6:
../../../Extern/include/boost/detail/container_fwd.hpp:63:65: note:                 'template<class charT, class traits, class Allocator> class std::basic_string'
   63 |     template <class charT, class traits, class Allocator> class basic_string;
      |                                                                 ^~~~~~~~~~~~
In file included from /usr/local/lib/gcc9/include/c++/ios:43,
                 from /usr/local/lib/gcc9/include/c++/ostream:38,
                 from /usr/local/lib/gcc9/include/c++/iterator:64,
                 from ../../../Extern/include/boost/detail/iterator.hpp:54,
                 from ../../../Extern/include/boost/iterator/iterator_categories.hpp:10,
                 from ../../../Extern/include/boost/unordered/detail/table.hpp:14,
                 from ../../../Extern/include/boost/unordered/detail/equivalent.hpp:10,
                 from ../../../Extern/include/boost/unordered/unordered_map.hpp:19,
                 from ../../../Extern/include/boost/unordered_map.hpp:16,
                 from char.h:4,
                 from BattleArena.cpp:6:
/usr/local/lib/gcc9/include/c++/streambuf:176:6: error: 'basic_string' has not been declared
  176 |      basic_string<_CharT2, _Traits2, _Alloc>&);
      |      ^~~~~~~~~~~~
/usr/local/lib/gcc9/include/c++/streambuf:176:18: error: expected ',' or '...' before '<' token
  176 |      basic_string<_CharT2, _Traits2, _Alloc>&);
      |                  ^
/usr/local/lib/gcc9/include/c++/streambuf:181:3: error: reference to 'basic_string' is ambiguous
  181 |   basic_string<_CharT2, _Traits2, _Alloc>&, _CharT2);
      |   ^~~~~~~~~~~~
In file included from /usr/local/lib/gcc9/include/c++/string:39,
                 from /usr/local/lib/gcc9/include/c++/stdexcept:39,
                 from /usr/local/lib/gcc9/include/c++/array:39,
                 from /usr/local/lib/gcc9/include/c++/tuple:39,
                 from /usr/local/lib/gcc9/include/c++/bits/stl_map.h:63,
                 from /usr/local/lib/gcc9/include/c++/map:61,
                 from stdafx.h:18,
                 from BattleArena.cpp:1:
/usr/local/lib/gcc9/include/c++/bits/stringfwd.h:74:11: note: candidates are: 'template<class _CharT, class _Traits, class _Alloc> class std::__cxx11::basic_string'
   74 |     class basic_string;
      |           ^~~~~~~~~~~~
In file included from ../../../Extern/include/boost/functional/hash/extensions.hpp:17,
                 from ../../../Extern/include/boost/functional/hash/hash.hpp:49 ,
                 from ../../../Extern/include/boost/functional/hash.hpp:6,
                 from ../../../Extern/include/boost/unordered/unordered_map.hpp:17,
                 from ../../../Extern/include/boost/unordered_map.hpp:16,
                 from char.h:4,
                 from BattleArena.cpp:6:
../../../Extern/include/boost/detail/container_fwd.hpp:63:65: note:                 'template<class charT, class traits, class Allocator> class std::basic_string'
   63 |     template <class charT, class traits, class Allocator> class basic_string;
      |                                                                 ^~~~~~~~~~~~
In file included from /usr/local/lib/gcc9/include/c++/ios:43,
                 from /usr/local/lib/gcc9/include/c++/ostream:38,
                 from /usr/local/lib/gcc9/include/c++/iterator:64,
                 from ../../../Extern/include/boost/detail/iterator.hpp:54,
                 from ../../../Extern/include/boost/iterator/iterator_categories.hpp:10,
                 from ../../../Extern/include/boost/unordered/detail/table.hpp:14,
                 from ../../../Extern/include/boost/unordered/detail/equivalent.hpp:10,
                 from ../../../Extern/include/boost/unordered/unordered_map.hpp:19,
                 from ../../../Extern/include/boost/unordered_map.hpp:16,
                 from char.h:4,
                 from BattleArena.cpp:6:
/usr/local/lib/gcc9/include/c++/streambuf:181:3: error: 'basic_string' has not been declared
  181 |   basic_string<_CharT2, _Traits2, _Alloc>&, _CharT2);
      |   ^~~~~~~~~~~~
/usr/local/lib/gcc9/include/c++/streambuf:181:15: error: expected ',' or '...' before '<' token
  181 |   basic_string<_CharT2, _Traits2, _Alloc>&, _CharT2);
      |               ^
In file included from /usr/local/lib/gcc9/include/c++/bits/locale_facets.h:2655,
                 from /usr/local/lib/gcc9/include/c++/bits/basic_ios.h:37,
                 from /usr/local/lib/gcc9/include/c++/ios:44,
                 from /usr/local/lib/gcc9/include/c++/ostream:38,
                 from /usr/local/lib/gcc9/include/c++/iterator:64,
                 from ../../../Extern/include/boost/detail/iterator.hpp:54,
                 from ../../../Extern/include/boost/iterator/iterator_categories.hpp:10,
                 from ../../../Extern/include/boost/unordered/detail/table.hpp:14,
                 from ../../../Extern/include/boost/unordered/detail/equivalent.hpp:10,
                 from ../../../Extern/include/boost/unordered/unordered_map.hpp:19,
                 from ../../../Extern/include/boost/unordered_map.hpp:16,
                 from char.h:4,
                 from BattleArena.cpp:6:
/usr/local/lib/gcc9/include/c++/bits/locale_facets.tcc: In member function 'void std::__numpunct_cache<_CharT>::_M_cache(const std::locale&)':
/usr/local/lib/gcc9/include/c++/bits/locale_facets.tcc:96:10: error: reference to 'basic_string' is ambiguous
   96 |    const basic_string<_CharT>& __tn = __np.truename();
      |          ^~~~~~~~~~~~
In file included from /usr/local/lib/gcc9/include/c++/string:39,
                 from /usr/local/lib/gcc9/include/c++/stdexcept:39,
                 from /usr/local/lib/gcc9/include/c++/array:39,
                 from /usr/local/lib/gcc9/include/c++/tuple:39,
                 from /usr/local/lib/gcc9/include/c++/bits/stl_map.h:63,
                 from /usr/local/lib/gcc9/include/c++/map:61,
                 from stdafx.h:18,
                 from BattleArena.cpp:1:
/usr/local/lib/gcc9/include/c++/bits/stringfwd.h:74:11: note: candidates are: 'template<class _CharT, class _Traits, class _Alloc> class std::__cxx11::basic_string'
   74 |     class basic_string;
      |           ^~~~~~~~~~~~
In file included from ../../../Extern/include/boost/functional/hash/extensions.hpp:17,
                 from ../../../Extern/include/boost/functional/hash/hash.hpp:49 ,
                 from ../../../Extern/include/boost/functional/hash.hpp:6,
                 from ../../../Extern/include/boost/unordered/unordered_map.hpp:17,
                 from ../../../Extern/include/boost/unordered_map.hpp:16,
                 from char.h:4,
                 from BattleArena.cpp:6:
../../../Extern/include/boost/detail/container_fwd.hpp:63:65: note:                 'template<class charT, class traits, class Allocator> class std::basic_string'
   63 |     template <class charT, class traits, class Allocator> class basic_string;
      |                                                                 ^~~~~~~~~~~~
In file included from /usr/local/lib/gcc9/include/c++/bits/locale_facets.h:2655,
                 from /usr/local/lib/gcc9/include/c++/bits/basic_ios.h:37,
                 from /usr/local/lib/gcc9/include/c++/ios:44,
                 from /usr/local/lib/gcc9/include/c++/ostream:38,
                 from /usr/local/lib/gcc9/include/c++/iterator:64,
                 from ../../../Extern/include/boost/detail/iterator.hpp:54,
                 from ../../../Extern/include/boost/iterator/iterator_categories.hpp:10,
                 from ../../../Extern/include/boost/unordered/detail/table.hpp:14,
                 from ../../../Extern/include/boost/unordered/detail/equivalent.hpp:10,
                 from ../../../Extern/include/boost/unordered/unordered_map.hpp:19,
                 from ../../../Extern/include/boost/unordered_map.hpp:16,
                 from char.h:4,
                 from BattleArena.cpp:6:
/usr/local/lib/gcc9/include/c++/bits/locale_facets.tcc:97:23: error: '__tn' was not declared in this scope
   97 |    _M_truename_size = __tn.size();
      |                       ^~~~
/usr/local/lib/gcc9/include/c++/bits/locale_facets.tcc:101:10: error: reference to 'basic_string' is ambiguous
  101 |    const basic_string<_CharT>& __fn = __np.falsename();
      |          ^~~~~~~~~~~~
In file included from /usr/local/lib/gcc9/include/c++/string:39,
                 from /usr/local/lib/gcc9/include/c++/stdexcept:39,
                 from /usr/local/lib/gcc9/include/c++/array:39,
                 from /usr/local/lib/gcc9/include/c++/tuple:39,
                 from /usr/local/lib/gcc9/include/c++/bits/stl_map.h:63,
                 from /usr/local/lib/gcc9/include/c++/map:61,
                 from stdafx.h:18,
                 from BattleArena.cpp:1:
/usr/local/lib/gcc9/include/c++/bits/stringfwd.h:74:11: note: candidates are: 'template<class _CharT, class _Traits, class _Alloc> class std::__cxx11::basic_string'
   74 |     class basic_string;
      |           ^~~~~~~~~~~~
In file included from ../../../Extern/include/boost/functional/hash/extensions.hpp:17,
                 from ../../../Extern/include/boost/functional/hash/hash.hpp:49 ,
                 from ../../../Extern/include/boost/functional/hash.hpp:6,
                 from ../../../Extern/include/boost/unordered/unordered_map.hpp:17,
                 from ../../../Extern/include/boost/unordered_map.hpp:16,
                 from char.h:4,
                 from BattleArena.cpp:6:
../../../Extern/include/boost/detail/container_fwd.hpp:63:65: note:                 'template<class charT, class traits, class Allocator> class std::basic_string'
   63 |     template <class charT, class traits, class Allocator> class basic_string;
      |                                                                 ^~~~~~~~~~~~
In file included from /usr/local/lib/gcc9/include/c++/bits/locale_facets.h:2655,
                 from /usr/local/lib/gcc9/include/c++/bits/basic_ios.h:37,
                 from /usr/local/lib/gcc9/include/c++/ios:44,
                 from /usr/local/lib/gcc9/include/c++/ostream:38,
                 from /usr/local/lib/gcc9/include/c++/iterator:64,
                 from ../../../Extern/include/boost/detail/iterator.hpp:54,
                 from ../../../Extern/include/boost/iterator/iterator_categories.hpp:10,
                 from ../../../Extern/include/boost/unordered/detail/table.hpp:14,
                 from ../../../Extern/include/boost/unordered/detail/equivalent.hpp:10,
                 from ../../../Extern/include/boost/unordered/unordered_map.hpp:19,
                 from ../../../Extern/include/boost/unordered_map.hpp:16,
                 from char.h:4,
                 from BattleArena.cpp:6:
/usr/local/lib/gcc9/include/c++/bits/locale_facets.tcc:102:24: error: '__fn' was not declared in this scope
  102 |    _M_falsename_size = __fn.size();
      |                        ^~~~
In file included from BattleArena.cpp:6:
char.h: At global scope:
char.h:944:9: error: reference to 'list' is ambiguous
  944 |   const std::list<CAffect *> & GetAffectContainer() const { return m_list_pkAffect; }
      |         ^~~
In file included from /usr/local/lib/gcc9/include/c++/list:63,
                 from stdafx.h:17,
                 from BattleArena.cpp:1:
/usr/local/lib/gcc9/include/c++/bits/stl_list.h:552:11: note: candidates are: 'template<class _Tp, class _Alloc> class std::__cxx11::list'
  552 |     class list : protected _List_base<_Tp, _Alloc>
      |           ^~~~
In file included from ../../../Extern/include/boost/functional/hash/extensions.hpp:17,
                 from ../../../Extern/include/boost/functional/hash/hash.hpp:49 ,
                 from ../../../Extern/include/boost/functional/hash.hpp:6,
                 from ../../../Extern/include/boost/unordered/unordered_map.hpp:17,
                 from ../../../Extern/include/boost/unordered_map.hpp:16,
                 from char.h:4,
                 from BattleArena.cpp:6:
../../../Extern/include/boost/detail/container_fwd.hpp:81:47: note:                 'template<class T, class Allocator> class std::list'
   81 |     template <class T, class Allocator> class list;
      |                                               ^~~~
In file included from BattleArena.cpp:6:
char.h:950:3: error: reference to 'list' is ambiguous
  950 |   std::list<CAffect *> m_list_pkAffect;
      |   ^~~
In file included from /usr/local/lib/gcc9/include/c++/list:63,
                 from stdafx.h:17,
                 from BattleArena.cpp:1:
/usr/local/lib/gcc9/include/c++/bits/stl_list.h:552:11: note: candidates are: 'template<class _Tp, class _Alloc> class std::__cxx11::list'
  552 |     class list : protected _List_base<_Tp, _Alloc>
      |           ^~~~
In file included from ../../../Extern/include/boost/functional/hash/extensions.hpp:17,
                 from ../../../Extern/include/boost/functional/hash/hash.hpp:49 ,
                 from ../../../Extern/include/boost/functional/hash.hpp:6,
                 from ../../../Extern/include/boost/unordered/unordered_map.hpp:17,
                 from ../../../Extern/include/boost/unordered_map.hpp:16,
                 from char.h:4,
                 from BattleArena.cpp:6:
../../../Extern/include/boost/detail/container_fwd.hpp:81:47: note:                 'template<class T, class Allocator> class std::list'
   81 |     template <class T, class Allocator> class list;
      |                                               ^~~~
gmake: *** [Makefile:129: OBJDIR/BattleArena.o] Error 1
gmake: *** Waiting for unfinished jobs....
[email protected]:/usr/src/mainline/Srcs/Server/game/src # clear
[email protected]:/usr/src/mainline/Srcs/Server/game/src # gmake -j2
Derleniyor BattleArena.cpp
Derleniyor MarkManager.cpp
g++: warning: '-mcpu=' is deprecated; use '-mtune=' or '-march=' instead
g++: warning: '-mcpu=' is deprecated; use '-mtune=' or '-march=' instead
In file included from ../../../Extern/include/boost/functional/hash/hash.hpp:49 ,
                 from ../../../Extern/include/boost/functional/hash.hpp:6,
                 from ../../../Extern/include/boost/unordered/unordered_map.hpp:17,
                 from ../../../Extern/include/boost/unordered_map.hpp:16,
                 from char.h:4,
                 from BattleArena.cpp:6:
../../../Extern/include/boost/functional/hash/extensions.hpp:38:33: error: 'template<class T, class A> std::size_t boost::hash_value' redeclared as different kind of entity
   38 |     std::size_t hash_value(std::list<T, A> const& v);
      |                                 ^~~~
In file included from ../../../Extern/include/boost/functional/hash.hpp:6,
                 from ../../../Extern/include/boost/unordered/unordered_map.hpp:17,
                 from ../../../Extern/include/boost/unordered_map.hpp:16,
                 from char.h:4,
                 from BattleArena.cpp:6:
../../../Extern/include/boost/functional/hash/hash.hpp:307:24: note: previous declaration 'std::size_t boost::hash_value(long double)'
  307 |     inline std::size_t hash_value(long double v)
      |                        ^~~~~~~~~~
In file included from ../../../Extern/include/boost/functional/hash/hash.hpp:49 ,
                 from ../../../Extern/include/boost/functional/hash.hpp:6,
                 from ../../../Extern/include/boost/unordered/unordered_map.hpp:17,
                 from ../../../Extern/include/boost/unordered_map.hpp:16,
                 from char.h:4,
                 from BattleArena.cpp:6:
../../../Extern/include/boost/functional/hash/extensions.hpp:38:33: error: reference to 'list' is ambiguous
   38 |     std::size_t hash_value(std::list<T, A> const& v);
      |                                 ^~~~
In file included from /usr/local/lib/gcc9/include/c++/list:63,
                 from stdafx.h:17,
                 from BattleArena.cpp:1:
/usr/local/lib/gcc9/include/c++/bits/stl_list.h:552:11: note: candidates are: 'template<class _Tp, class _Alloc> class std::__cxx11::list'
  552 |     class list : protected _List_base<_Tp, _Alloc>
      |           ^~~~
In file included from ../../../Extern/include/boost/functional/hash/extensions.hpp:17,
                 from ../../../Extern/include/boost/functional/hash/hash.hpp:49 ,
                 from ../../../Extern/include/boost/functional/hash.hpp:6,
                 from ../../../Extern/include/boost/unordered/unordered_map.hpp:17,
                 from ../../../Extern/include/boost/unordered_map.hpp:16,
                 from char.h:4,
                 from BattleArena.cpp:6:
../../../Extern/include/boost/detail/container_fwd.hpp:81:47: note:                 'template<class T, class Allocator> class std::list'
   81 |     template <class T, class Allocator> class list;
      |                                               ^~~~
In file included from ../../../Extern/include/boost/functional/hash/hash.hpp:49 ,
                 from ../../../Extern/include/boost/functional/hash.hpp:6,
                 from ../../../Extern/include/boost/unordered/unordered_map.hpp:17,
                 from ../../../Extern/include/boost/unordered_map.hpp:16,
                 from char.h:4,
                 from BattleArena.cpp:6:
../../../Extern/include/boost/functional/hash/extensions.hpp:38:39: error: expected primary-expression before ',' token
   38 |     std::size_t hash_value(std::list<T, A> const& v);
      |                                       ^
../../../Extern/include/boost/functional/hash/extensions.hpp:38:42: error: expected primary-expression before '>' token
   38 |     std::size_t hash_value(std::list<T, A> const& v);
      |                                          ^
../../../Extern/include/boost/functional/hash/extensions.hpp:38:44: error: expected primary-expression before 'const'
   38 |     std::size_t hash_value(std::list<T, A> const& v);
      |                                            ^~~~~
../../../Extern/include/boost/functional/hash/extensions.hpp:69:33: error: 'template<class T, class A> std::size_t boost::hash_value' redeclared as different kind of entity
   69 |     std::size_t hash_value(std::list<T, A> const& v)
      |                                 ^~~~
In file included from ../../../Extern/include/boost/functional/hash.hpp:6,
                 from ../../../Extern/include/boost/unordered/unordered_map.hpp:17,
                 from ../../../Extern/include/boost/unordered_map.hpp:16,
                 from char.h:4,
                 from BattleArena.cpp:6:
../../../Extern/include/boost/functional/hash/hash.hpp:307:24: note: previous declaration 'std::size_t boost::hash_value(long double)'
  307 |     inline std::size_t hash_value(long double v)
      |                        ^~~~~~~~~~
In file included from ../../../Extern/include/boost/functional/hash/hash.hpp:49 ,
                 from ../../../Extern/include/boost/functional/hash.hpp:6,
                 from ../../../Extern/include/boost/unordered/unordered_map.hpp:17,
                 from ../../../Extern/include/boost/unordered_map.hpp:16,
                 from char.h:4,
                 from BattleArena.cpp:6:
../../../Extern/include/boost/functional/hash/extensions.hpp:69:33: error: reference to 'list' is ambiguous
   69 |     std::size_t hash_value(std::list<T, A> const& v)
      |                                 ^~~~
In file included from /usr/local/lib/gcc9/include/c++/list:63,
                 from stdafx.h:17,
                 from BattleArena.cpp:1:
/usr/local/lib/gcc9/include/c++/bits/stl_list.h:552:11: note: candidates are: 'template<class _Tp, class _Alloc> class std::__cxx11::list'
  552 |     class list : protected _List_base<_Tp, _Alloc>
      |           ^~~~
In file included from ../../../Extern/include/boost/functional/hash/extensions.hpp:17,
                 from ../../../Extern/include/boost/functional/hash/hash.hpp:49 ,
                 from ../../../Extern/include/boost/functional/hash.hpp:6,
                 from ../../../Extern/include/boost/unordered/unordered_map.hpp:17,
                 from ../../../Extern/include/boost/unordered_map.hpp:16,
                 from char.h:4,
                 from BattleArena.cpp:6:
../../../Extern/include/boost/detail/container_fwd.hpp:81:47: note:                 'template<class T, class Allocator> class std::list'
   81 |     template <class T, class Allocator> class list;
      |                                               ^~~~
In file included from ../../../Extern/include/boost/functional/hash/hash.hpp:49 ,
                 from ../../../Extern/include/boost/functional/hash.hpp:6,
                 from ../../../Extern/include/boost/unordered/unordered_map.hpp:17,
                 from ../../../Extern/include/boost/unordered_map.hpp:16,
                 from char.h:4,
                 from BattleArena.cpp:6:
../../../Extern/include/boost/functional/hash/extensions.hpp:69:39: error: expected primary-expression before ',' token
   69 |     std::size_t hash_value(std::list<T, A> const& v)
      |                                       ^
../../../Extern/include/boost/functional/hash/extensions.hpp:69:42: error: expected primary-expression before '>' token
   69 |     std::size_t hash_value(std::list<T, A> const& v)
      |                                          ^
../../../Extern/include/boost/functional/hash/extensions.hpp:69:44: error: expected primary-expression before 'const'
   69 |     std::size_t hash_value(std::list<T, A> const& v)
      |                                            ^~~~~
In file included from /usr/local/lib/gcc9/include/c++/bits/ios_base.h:41,
                 from /usr/local/lib/gcc9/include/c++/ios:42,
                 from /usr/local/lib/gcc9/include/c++/ostream:38,
                 from /usr/local/lib/gcc9/include/c++/iterator:64,
                 from ../../../Extern/include/boost/detail/iterator.hpp:54,
                 from ../../../Extern/include/boost/iterator/iterator_categories.hpp:10,
                 from ../../../Extern/include/boost/unordered/detail/table.hpp:14,
                 from ../../../Extern/include/boost/unordered/detail/equivalent.hpp:10,
                 from ../../../Extern/include/boost/unordered/unordered_map.hpp:19,
                 from ../../../Extern/include/boost/unordered_map.hpp:16,
                 from char.h:4,
                 from BattleArena.cpp:6:
/usr/local/lib/gcc9/include/c++/bits/locale_classes.h:284:24: error: reference to 'basic_string' is ambiguous
  284 |       operator()(const basic_string<_Char, _Traits, _Alloc>& __s1,
      |                        ^~~~~~~~~~~~
In file included from /usr/local/lib/gcc9/include/c++/string:39,
                 from /usr/local/lib/gcc9/include/c++/stdexcept:39,
                 from /usr/local/lib/gcc9/include/c++/array:39,
                 from /usr/local/lib/gcc9/include/c++/tuple:39,
                 from /usr/local/lib/gcc9/include/c++/bits/stl_map.h:63,
                 from /usr/local/lib/gcc9/include/c++/map:61,
                 from stdafx.h:18,
                 from BattleArena.cpp:1:
/usr/local/lib/gcc9/include/c++/bits/stringfwd.h:74:11: note: candidates are: 'template<class _CharT, class _Traits, class _Alloc> class std::__cxx11::basic_string'
   74 |     class basic_string;
      |           ^~~~~~~~~~~~
In file included from ../../../Extern/include/boost/functional/hash/extensions.hpp:17,
                 from ../../../Extern/include/boost/functional/hash/hash.hpp:49 ,
                 from ../../../Extern/include/boost/functional/hash.hpp:6,
                 from ../../../Extern/include/boost/unordered/unordered_map.hpp:17,
                 from ../../../Extern/include/boost/unordered_map.hpp:16,
                 from char.h:4,
                 from BattleArena.cpp:6:
../../../Extern/include/boost/detail/container_fwd.hpp:63:65: note:                 'template<class charT, class traits, class Allocator> class std::basic_string'
   63 |     template <class charT, class traits, class Allocator> class basic_string;
      |                                                                 ^~~~~~~~~~~~
In file included from /usr/local/lib/gcc9/include/c++/bits/ios_base.h:41,
                 from /usr/local/lib/gcc9/include/c++/ios:42,
                 from /usr/local/lib/gcc9/include/c++/ostream:38,
                 from /usr/local/lib/gcc9/include/c++/iterator:64,
                 from ../../../Extern/include/boost/detail/iterator.hpp:54,
                 from ../../../Extern/include/boost/iterator/iterator_categories.hpp:10,
                 from ../../../Extern/include/boost/unordered/detail/table.hpp:14,
                 from ../../../Extern/include/boost/unordered/detail/equivalent.hpp:10,
                 from ../../../Extern/include/boost/unordered/unordered_map.hpp:19,
                 from ../../../Extern/include/boost/unordered_map.hpp:16,
                 from char.h:4,
                 from BattleArena.cpp:6:
/usr/local/lib/gcc9/include/c++/bits/locale_classes.h:284:36: error: expected ' ' or '...' before '<' token
  284 |       operator()(const basic_string<_Char, _Traits, _Alloc>& __s1,
      |                                    ^
In file included from /usr/local/lib/gcc9/include/c++/bits/locale_classes.h:851,
                 from /usr/local/lib/gcc9/include/c++/bits/ios_base.h:41,
                 from /usr/local/lib/gcc9/include/c++/ios:42,
                 from /usr/local/lib/gcc9/include/c++/ostream:38,
                 from /usr/local/lib/gcc9/include/c++/iterator:64,
                 from ../../../Extern/include/boost/detail/iterator.hpp:54,
                 from ../../../Extern/include/boost/iterator/iterator_categories.hpp:10,
                 from ../../../Extern/include/boost/unordered/detail/table.hpp:14,
                 from ../../../Extern/include/boost/unordered/detail/equivalent.hpp:10,
                 from ../../../Extern/include/boost/unordered/unordered_map.hpp:19,
                 from ../../../Extern/include/boost/unordered_map.hpp:16,
                 from char.h:4,
                 from BattleArena.cpp:6:
/usr/local/lib/gcc9/include/c++/bits/locale_classes.tcc:81:22: error: reference to 'basic_string' is ambiguous
   81 |     operator()(const basic_string<_CharT, _Traits, _Alloc>& __s1,
      |                      ^~~~~~~~~~~~
In file included from /usr/local/lib/gcc9/include/c++/string:39,
                 from /usr/local/lib/gcc9/include/c++/stdexcept:39,
                 from /usr/local/lib/gcc9/include/c++/array:39,
                 from /usr/local/lib/gcc9/include/c++/tuple:39,
                 from /usr/local/lib/gcc9/include/c++/bits/stl_map.h:63,
                 from /usr/local/lib/gcc9/include/c++/map:61,
                 from stdafx.h:18,
                 from BattleArena.cpp:1:
/usr/local/lib/gcc9/include/c++/bits/stringfwd.h:74:11: note: candidates are: 'template<class _CharT, class _Traits, class _Alloc> class std::__cxx11::basic_string'
   74 |     class basic_string;
      |           ^~~~~~~~~~~~
In file included from ../../../Extern/include/boost/functional/hash/extensions.hpp:17,
                 from ../../../Extern/include/boost/functional/hash/hash.hpp:49 ,
                 from ../../../Extern/include/boost/functional/hash.hpp:6,
                 from ../../../Extern/include/boost/unordered/unordered_map.hpp:17,
                 from ../../../Extern/include/boost/unordered_map.hpp:16,
                 from char.h:4,
                 from BattleArena.cpp:6:
../../../Extern/include/boost/detail/container_fwd.hpp:63:65: note:                 'template<class charT, class traits, class Allocator> class std::basic_string'
   63 |     template <class charT, class traits, class Allocator> class basic_string;
      |                                                                 ^~~~~~~~~~~~
In file included from /usr/local/lib/gcc9/include/c++/bits/locale_classes.h:851,
                 from /usr/local/lib/gcc9/include/c++/bits/ios_base.h:41,
                 from /usr/local/lib/gcc9/include/c++/ios:42,
                 from /usr/local/lib/gcc9/include/c++/ostream:38,
                 from /usr/local/lib/gcc9/include/c++/iterator:64,
                 from ../../../Extern/include/boost/detail/iterator.hpp:54,
                 from ../../../Extern/include/boost/iterator/iterator_categories.hpp:10,
                 from ../../../Extern/include/boost/unordered/detail/table.hpp:14,
                 from ../../../Extern/include/boost/unordered/detail/equivalent.hpp:10,
                 from ../../../Extern/include/boost/unordered/unordered_map.hpp:19,
                 from ../../../Extern/include/boost/unordered_map.hpp:16,
                 from char.h:4,
                 from BattleArena.cpp:6:
/usr/local/lib/gcc9/include/c++/bits/locale_classes.tcc:81:34: error: expected  ,' or '...' before '<' token
   81 |     operator()(const basic_string<_CharT, _Traits, _Alloc>& __s1,
      |                                  ^
/usr/local/lib/gcc9/include/c++/bits/locale_classes.tcc: In member function 'bool std::locale::operator()(int) const':
/usr/local/lib/gcc9/include/c++/bits/locale_classes.tcc:86:33: error: '__s1' was not declared in this scope
   86 |       return (__collate.compare(__s1.data(), __s1.data() + __s1.length(),
      |                                 ^~~~
/usr/local/lib/gcc9/include/c++/bits/locale_classes.tcc:87:5: error: '__s2' was not declared in this scope
   87 |     __s2.data(), __s2.data() + __s2.length()) < 0);
      |     ^~~~
In file included from /usr/local/lib/gcc9/include/c++/ios:43,
                 from /usr/local/lib/gcc9/include/c++/ostream:38,
                 from /usr/local/lib/gcc9/include/c++/iterator:64,
                 from ../../../Extern/include/boost/detail/iterator.hpp:54,
                 from ../../../Extern/include/boost/iterator/iterator_categories.hpp:10,
                 from ../../../Extern/include/boost/unordered/detail/table.hpp:14,
                 from ../../../Extern/include/boost/unordered/detail/equivalent.hpp:10,
                 from ../../../Extern/include/boost/unordered/unordered_map.hpp:19,
                 from ../../../Extern/include/boost/unordered_map.hpp:16,
                 from char.h:4,
                 from BattleArena.cpp:6:
/usr/local/lib/gcc9/include/c++/streambuf: At global scope:
/usr/local/lib/gcc9/include/c++/streambuf:176:6: error: reference to 'basic_string' is ambiguous
  176 |      basic_string<_CharT2, _Traits2, _Alloc>&);
      |      ^~~~~~~~~~~~
In file included from /usr/local/lib/gcc9/include/c++/string:39,
                 from /usr/local/lib/gcc9/include/c++/stdexcept:39,
                 from /usr/local/lib/gcc9/include/c++/array:39,
                 from /usr/local/lib/gcc9/include/c++/tuple:39,
                 from /usr/local/lib/gcc9/include/c++/bits/stl_map.h:63,
                 from /usr/local/lib/gcc9/include/c++/map:61,
                 from stdafx.h:18,
                 from BattleArena.cpp:1:
/usr/local/lib/gcc9/include/c++/bits/stringfwd.h:74:11: note: candidates are: 'template<class _CharT, class _Traits, class _Alloc> class std::__cxx11::basic_string'
   74 |     class basic_string;
      |           ^~~~~~~~~~~~
In file included from ../../../Extern/include/boost/functional/hash/extensions.hpp:17,
                 from ../../../Extern/include/boost/functional/hash/hash.hpp:49 ,
                 from ../../../Extern/include/boost/functional/hash.hpp:6,
                 from ../../../Extern/include/boost/unordered/unordered_map.hpp:17,
                 from ../../../Extern/include/boost/unordered_map.hpp:16,
                 from char.h:4,
                 from BattleArena.cpp:6:
../../../Extern/include/boost/detail/container_fwd.hpp:63:65: note:                 'template<class charT, class traits, class Allocator> class std::basic_string'
   63 |     template <class charT, class traits, class Allocator> class basic_string;
      |                                                                 ^~~~~~~~~~~~
In file included from /usr/local/lib/gcc9/include/c++/ios:43,
                 from /usr/local/lib/gcc9/include/c++/ostream:38,
                 from /usr/local/lib/gcc9/include/c++/iterator:64,
                 from ../../../Extern/include/boost/detail/iterator.hpp:54,
                 from ../../../Extern/include/boost/iterator/iterator_categories.hpp:10,
                 from ../../../Extern/include/boost/unordered/detail/table.hpp:14,
                 from ../../../Extern/include/boost/unordered/detail/equivalent.hpp:10,
                 from ../../../Extern/include/boost/unordered/unordered_map.hpp:19,
                 from ../../../Extern/include/boost/unordered_map.hpp:16,
                 from char.h:4,
                 from BattleArena.cpp:6:
/usr/local/lib/gcc9/include/c++/streambuf:176:6: error: 'basic_string' has not been declared
  176 |      basic_string<_CharT2, _Traits2, _Alloc>&);
      |      ^~~~~~~~~~~~
/usr/local/lib/gcc9/include/c++/streambuf:176:18: error: expected ',' or '...' before '<' token
  176 |      basic_string<_CharT2, _Traits2, _Alloc>&);
      |                  ^
/usr/local/lib/gcc9/include/c++/streambuf:181:3: error: reference to 'basic_string' is ambiguous
  181 |   basic_string<_CharT2, _Traits2, _Alloc>&, _CharT2);
      |   ^~~~~~~~~~~~
In file included from /usr/local/lib/gcc9/include/c++/string:39,
                 from /usr/local/lib/gcc9/include/c++/stdexcept:39,
                 from /usr/local/lib/gcc9/include/c++/array:39,
                 from /usr/local/lib/gcc9/include/c++/tuple:39,
                 from /usr/local/lib/gcc9/include/c++/bits/stl_map.h:63,
                 from /usr/local/lib/gcc9/include/c++/map:61,
                 from stdafx.h:18,
                 from BattleArena.cpp:1:
/usr/local/lib/gcc9/include/c++/bits/stringfwd.h:74:11: note: candidates are: 'template<class _CharT, class _Traits, class _Alloc> class std::__cxx11::basic_string'
   74 |     class basic_string;
      |           ^~~~~~~~~~~~
In file included from ../../../Extern/include/boost/functional/hash/extensions.hpp:17,
                 from ../../../Extern/include/boost/functional/hash/hash.hpp:49 ,
                 from ../../../Extern/include/boost/functional/hash.hpp:6,
                 from ../../../Extern/include/boost/unordered/unordered_map.hpp:17,
                 from ../../../Extern/include/boost/unordered_map.hpp:16,
                 from char.h:4,
                 from BattleArena.cpp:6:
../../../Extern/include/boost/detail/container_fwd.hpp:63:65: note:                 'template<class charT, class traits, class Allocator> class std::basic_string'
   63 |     template <class charT, class traits, class Allocator> class basic_string;
      |                                                                 ^~~~~~~~~~~~
In file included from /usr/local/lib/gcc9/include/c++/ios:43,
                 from /usr/local/lib/gcc9/include/c++/ostream:38,
                 from /usr/local/lib/gcc9/include/c++/iterator:64,
                 from ../../../Extern/include/boost/detail/iterator.hpp:54,
                 from ../../../Extern/include/boost/iterator/iterator_categories.hpp:10,
                 from ../../../Extern/include/boost/unordered/detail/table.hpp:14,
                 from ../../../Extern/include/boost/unordered/detail/equivalent.hpp:10,
                 from ../../../Extern/include/boost/unordered/unordered_map.hpp:19,
                 from ../../../Extern/include/boost/unordered_map.hpp:16,
                 from char.h:4,
                 from BattleArena.cpp:6:
/usr/local/lib/gcc9/include/c++/streambuf:181:3: error: 'basic_string' has not been declared
  181 |   basic_string<_CharT2, _Traits2, _Alloc>&, _CharT2);
      |   ^~~~~~~~~~~~
/usr/local/lib/gcc9/include/c++/streambuf:181:15: error: expected ',' or '...' before '<' token
  181 |   basic_string<_CharT2, _Traits2, _Alloc>&, _CharT2);
      |               ^
In file included from /usr/local/lib/gcc9/include/c++/bits/locale_facets.h:2655,
                 from /usr/local/lib/gcc9/include/c++/bits/basic_ios.h:37,
                 from /usr/local/lib/gcc9/include/c++/ios:44,
                 from /usr/local/lib/gcc9/include/c++/ostream:38,
                 from /usr/local/lib/gcc9/include/c++/iterator:64,
                 from ../../../Extern/include/boost/detail/iterator.hpp:54,
                 from ../../../Extern/include/boost/iterator/iterator_categories.hpp:10,
                 from ../../../Extern/include/boost/unordered/detail/table.hpp:14,
                 from ../../../Extern/include/boost/unordered/detail/equivalent.hpp:10,
                 from ../../../Extern/include/boost/unordered/unordered_map.hpp:19,
                 from ../../../Extern/include/boost/unordered_map.hpp:16,
                 from char.h:4,
                 from BattleArena.cpp:6:
/usr/local/lib/gcc9/include/c++/bits/locale_facets.tcc: In member function 'void std::__numpunct_cache<_CharT>::_M_cache(const std::locale&)':
/usr/local/lib/gcc9/include/c++/bits/locale_facets.tcc:96:10: error: reference to 'basic_string' is ambiguous
   96 |    const basic_string<_CharT>& __tn = __np.truename();
      |          ^~~~~~~~~~~~
In file included from /usr/local/lib/gcc9/include/c++/string:39,
                 from /usr/local/lib/gcc9/include/c++/stdexcept:39,
                 from /usr/local/lib/gcc9/include/c++/array:39,
                 from /usr/local/lib/gcc9/include/c++/tuple:39,
                 from /usr/local/lib/gcc9/include/c++/bits/stl_map.h:63,
                 from /usr/local/lib/gcc9/include/c++/map:61,
                 from stdafx.h:18,
                 from BattleArena.cpp:1:
/usr/local/lib/gcc9/include/c++/bits/stringfwd.h:74:11: note: candidates are: 'template<class _CharT, class _Traits, class _Alloc> class std::__cxx11::basic_string'
   74 |     class basic_string;
      |           ^~~~~~~~~~~~
In file included from ../../../Extern/include/boost/functional/hash/extensions.hpp:17,
                 from ../../../Extern/include/boost/functional/hash/hash.hpp:49 ,
                 from ../../../Extern/include/boost/functional/hash.hpp:6,
                 from ../../../Extern/include/boost/unordered/unordered_map.hpp:17,
                 from ../../../Extern/include/boost/unordered_map.hpp:16,
                 from char.h:4,
                 from BattleArena.cpp:6:
../../../Extern/include/boost/detail/container_fwd.hpp:63:65: note:                 'template<class charT, class traits, class Allocator> class std::basic_string'
   63 |     template <class charT, class traits, class Allocator> class basic_string;
      |                                                                 ^~~~~~~~~~~~
In file included from /usr/local/lib/gcc9/include/c++/bits/locale_facets.h:2655,
                 from /usr/local/lib/gcc9/include/c++/bits/basic_ios.h:37,
                 from /usr/local/lib/gcc9/include/c++/ios:44,
                 from /usr/local/lib/gcc9/include/c++/ostream:38,
                 from /usr/local/lib/gcc9/include/c++/iterator:64,
                 from ../../../Extern/include/boost/detail/iterator.hpp:54,
                 from ../../../Extern/include/boost/iterator/iterator_categories.hpp:10,
                 from ../../../Extern/include/boost/unordered/detail/table.hpp:14,
                 from ../../../Extern/include/boost/unordered/detail/equivalent.hpp:10,
                 from ../../../Extern/include/boost/unordered/unordered_map.hpp:19,
                 from ../../../Extern/include/boost/unordered_map.hpp:16,
                 from char.h:4,
                 from BattleArena.cpp:6:
/usr/local/lib/gcc9/include/c++/bits/locale_facets.tcc:97:23: error: '__tn' was not declared in this scope
   97 |    _M_truename_size = __tn.size();
      |                       ^~~~
/usr/local/lib/gcc9/include/c++/bits/locale_facets.tcc:101:10: error: reference to 'basic_string' is ambiguous
  101 |    const basic_string<_CharT>& __fn = __np.falsename();
      |          ^~~~~~~~~~~~
In file included from /usr/local/lib/gcc9/include/c++/string:39,
                 from /usr/local/lib/gcc9/include/c++/stdexcept:39,
                 from /usr/local/lib/gcc9/include/c++/array:39,
                 from /usr/local/lib/gcc9/include/c++/tuple:39,
                 from /usr/local/lib/gcc9/include/c++/bits/stl_map.h:63,
                 from /usr/local/lib/gcc9/include/c++/map:61,
                 from stdafx.h:18,
                 from BattleArena.cpp:1:
/usr/local/lib/gcc9/include/c++/bits/stringfwd.h:74:11: note: candidates are: 'template<class _CharT, class _Traits, class _Alloc> class std::__cxx11::basic_string'
   74 |     class basic_string;
      |           ^~~~~~~~~~~~
In file included from ../../../Extern/include/boost/functional/hash/extensions.hpp:17,
                 from ../../../Extern/include/boost/functional/hash/hash.hpp:49 ,
                 from ../../../Extern/include/boost/functional/hash.hpp:6,
                 from ../../../Extern/include/boost/unordered/unordered_map.hpp:17,
                 from ../../../Extern/include/boost/unordered_map.hpp:16,
                 from char.h:4,
                 from BattleArena.cpp:6:
../../../Extern/include/boost/detail/container_fwd.hpp:63:65: note:                 'template<class charT, class traits, class Allocator> class std::basic_string'
   63 |     template <class charT, class traits, class Allocator> class basic_string;
      |                                                                 ^~~~~~~~~~~~
In file included from /usr/local/lib/gcc9/include/c++/bits/locale_facets.h:2655,
                 from /usr/local/lib/gcc9/include/c++/bits/basic_ios.h:37,
                 from /usr/local/lib/gcc9/include/c++/ios:44,
                 from /usr/local/lib/gcc9/include/c++/ostream:38,
                 from /usr/local/lib/gcc9/include/c++/iterator:64,
                 from ../../../Extern/include/boost/detail/iterator.hpp:54,
                 from ../../../Extern/include/boost/iterator/iterator_categories.hpp:10,
                 from ../../../Extern/include/boost/unordered/detail/table.hpp:14,
                 from ../../../Extern/include/boost/unordered/detail/equivalent.hpp:10,
                 from ../../../Extern/include/boost/unordered/unordered_map.hpp:19,
                 from ../../../Extern/include/boost/unordered_map.hpp:16,
                 from char.h:4,
                 from BattleArena.cpp:6:
/usr/local/lib/gcc9/include/c++/bits/locale_facets.tcc:102:24: error: '__fn' was not declared in this scope
  102 |    _M_falsename_size = __fn.size();
      |                        ^~~~
In file included from BattleArena.cpp:6:
char.h: At global scope:
char.h:944:9: error: reference to 'list' is ambiguous
  944 |   const std::list<CAffect *> & GetAffectContainer() const { return m_list_pkAffect; }
      |         ^~~
In file included from /usr/local/lib/gcc9/include/c++/list:63,
                 from stdafx.h:17,
                 from BattleArena.cpp:1:
/usr/local/lib/gcc9/include/c++/bits/stl_list.h:552:11: note: candidates are: 'template<class _Tp, class _Alloc> class std::__cxx11::list'
  552 |     class list : protected _List_base<_Tp, _Alloc>
      |           ^~~~
In file included from ../../../Extern/include/boost/functional/hash/extensions.hpp:17,
                 from ../../../Extern/include/boost/functional/hash/hash.hpp:49 ,
                 from ../../../Extern/include/boost/functional/hash.hpp:6,
                 from ../../../Extern/include/boost/unordered/unordered_map.hpp:17,
                 from ../../../Extern/include/boost/unordered_map.hpp:16,
                 from char.h:4,
                 from BattleArena.cpp:6:
../../../Extern/include/boost/detail/container_fwd.hpp:81:47: note:                 'template<class T, class Allocator> class std::list'
   81 |     template <class T, class Allocator> class list;
      |                                               ^~~~
In file included from BattleArena.cpp:6:
char.h:950:3: error: reference to 'list' is ambiguous
  950 |   std::list<CAffect *> m_list_pkAffect;
      |   ^~~
In file included from /usr/local/lib/gcc9/include/c++/list:63,
                 from stdafx.h:17,
                 from BattleArena.cpp:1:
/usr/local/lib/gcc9/include/c++/bits/stl_list.h:552:11: note: candidates are: 'template<class _Tp, class _Alloc> class std::__cxx11::list'
  552 |     class list : protected _List_base<_Tp, _Alloc>
      |           ^~~~
In file included from ../../../Extern/include/boost/functional/hash/extensions.hpp:17,
                 from ../../../Extern/include/boost/functional/hash/hash.hpp:49 ,
                 from ../../../Extern/include/boost/functional/hash.hpp:6,
                 from ../../../Extern/include/boost/unordered/unordered_map.hpp:17,
                 from ../../../Extern/include/boost/unordered_map.hpp:16,
                 from char.h:4,
                 from BattleArena.cpp:6:
../../../Extern/include/boost/detail/container_fwd.hpp:81:47: note:                 'template<class T, class Allocator> class std::list'
   81 |     template <class T, class Allocator> class list;
      |                                               ^~~~
gmake: *** [Makefile:129: OBJDIR/BattleArena.o] Error 1
gmake: *** Waiting for unfinished jobs....
[email protected]:/usr/src/mainline/Srcs/Server/game/src
 
Last edited:

TeoDoR

SuperModerator
SuperModerator
Joined
Jun 10, 2019
Messages
154
Reaction score
1,216
Points
93
Location
Bucharest
Credits
103
Hello @Cunoo,
look
Code:
g++: warning: '-mcpu=' is deprecated; use '-mtune=' or '-march=' instead
Open your Makefile, search -mcpu= and change with -mtune= or -march=
 

Cunoo

Banned
Banned
Joined
May 9, 2019
Messages
37
Reaction score
103
Points
18
Credits
0
Hello @Cunoo,
look
Code:
g++: warning: '-mcpu=' is deprecated; use '-mtune=' or '-march=' instead
Open your Makefile, search -mcpu= and change with -mtune= or -march=
i change but i have still erors....

like this

/usr/local/lib/gcc9/include/c++/streambuf:181:3: error: 'basic_string' has not been declared
181 | basic_string<_CharT2, _Traits2, _Alloc>&, _CharT2);
| ^~~~~~~~~~~~
/usr/local/lib/gcc9/include/c++/streambuf:181:15: error: expected ',' or '...' before '<' token
181 | basic_string<_CharT2, _Traits2, _Alloc>&, _CharT2);
| ^
In file included from /usr/local/lib/gcc9/include/c++/bits/locale_facets.h:2655,
from /usr/local/lib/gcc9/include/c++/bits/basic_ios.h:37,
from /usr/local/lib/gcc9/include/c++/ios:44,
from /usr/local/lib/gcc9/include/c++/ostream:38,
from /usr/local/lib/gcc9/include/c++/iterator:64,
from ../../../Extern/include/boost/detail/iterator.hpp:54,
from ../../../Extern/include/boost/iterator/iterator_categories.hpp:10,
from ../../../Extern/include/boost/unordered/detail/table.hpp:14,
from ../../../Extern/include/boost/unordered/detail/equivalent.hpp:10,
from ../../../Extern/include/boost/unordered/unordered_map.hpp:19,
from ../../../Extern/include/boost/unordered_map.hpp:16,
from char.h:4,
from BattleArena.cpp:6:
/usr/local/lib/gcc9/include/c++/bits/locale_facets.tcc: In member function 'void std::__numpunct_cache<_CharT>::_M_cache(const std::locale&)':
/usr/local/lib/gcc9/include/c++/bits/locale_facets.tcc:96:10: error: reference to 'basic_string' is ambiguous
96 | const basic_string<_CharT>& __tn = __np.truename();


look at on previus reply :/
 

TeoDoR

SuperModerator
SuperModerator
Joined
Jun 10, 2019
Messages
154
Reaction score
1,216
Points
93
Location
Bucharest
Credits
103
i change but i have still erors....

like this

/usr/local/lib/gcc9/include/c++/streambuf:181:3: error: 'basic_string' has not been declared
181 | basic_string<_CharT2, _Traits2, _Alloc>&, _CharT2);
| ^~~~~~~~~~~~
/usr/local/lib/gcc9/include/c++/streambuf:181:15: error: expected ',' or '...' before '<' token
181 | basic_string<_CharT2, _Traits2, _Alloc>&, _CharT2);
| ^
In file included from /usr/local/lib/gcc9/include/c++/bits/locale_facets.h:2655,
from /usr/local/lib/gcc9/include/c++/bits/basic_ios.h:37,
from /usr/local/lib/gcc9/include/c++/ios:44,
from /usr/local/lib/gcc9/include/c++/ostream:38,
from /usr/local/lib/gcc9/include/c++/iterator:64,
from ../../../Extern/include/boost/detail/iterator.hpp:54,
from ../../../Extern/include/boost/iterator/iterator_categories.hpp:10,
from ../../../Extern/include/boost/unordered/detail/table.hpp:14,
from ../../../Extern/include/boost/unordered/detail/equivalent.hpp:10,
from ../../../Extern/include/boost/unordered/unordered_map.hpp:19,
from ../../../Extern/include/boost/unordered_map.hpp:16,
from char.h:4,
from BattleArena.cpp:6:
/usr/local/lib/gcc9/include/c++/bits/locale_facets.tcc: In member function 'void std::__numpunct_cache<_CharT>::_M_cache(const std::locale&)':
/usr/local/lib/gcc9/include/c++/bits/locale_facets.tcc:96:10: error: reference to 'basic_string' is ambiguous
96 | const basic_string<_CharT>& __tn = __np.truename();


look at on previus reply :/
I don't offer support in pm. You need a fresh OS.
Reinstall your FreeBSD 9.3 32bit and install again the libs.

Install gmake:
Code:
cd /usr/ports/devel/gmake && make install clean
Install makedepend:
Code:
cd /usr/ports/devel/makedepend && make install clean
Install subversion:
Code:
cd /usr/ports/devel/subversion && make install clean
Install devil:
Code:
cd /usr/ports/graphics/devil && make install clean
Install GCC48:
Code:
cd /usr/ports/lang/gcc48/ && make install clean
or
GCC49
Code:
cd /usr/ports/lang/gcc49/ && make install clean
Install python:
Code:
cd /usr/ports/lang/python && make install clean
Only with that i can help you. Good luck.
Oh.. don't forget. Don't execute the command portsnap fetch extract or portsnap fetch update
 

Cunoo

Banned
Banned
Joined
May 9, 2019
Messages
37
Reaction score
103
Points
18
Credits
0
I don't offer support in pm. You need a fresh OS.
Reinstall your FreeBSD 9.3 32bit and install again the libs.

Install gmake:
Code:
cd /usr/ports/devel/gmake && make install clean
Install makedepend:
Code:
cd /usr/ports/devel/makedepend && make install clean
Install subversion:
Code:
cd /usr/ports/devel/subversion && make install clean
Install devil:
Code:
cd /usr/ports/graphics/devil && make install clean
Install GCC48:
Code:
cd /usr/ports/lang/gcc48/ && make install clean
or
GCC49
Code:
cd /usr/ports/lang/gcc49/ && make install clean
Install python:
Code:
cd /usr/ports/lang/python && make install clean
Only with that i can help you. Good luck.
Oh.. don't forget. Don't execute the command portsnap fetch extract or portsnap fetch update
I have 11.2 stable its a problem ?
 

TeoDoR

SuperModerator
SuperModerator
Joined
Jun 10, 2019
Messages
154
Reaction score
1,216
Points
93
Location
Bucharest
Credits
103
To compile the source you need the versiun 9.3 32bit .
 

Cunoo

Banned
Banned
Joined
May 9, 2019
Messages
37
Reaction score
103
Points
18
Credits
0
Last edited:

TeoDoR

SuperModerator
SuperModerator
Joined
Jun 10, 2019
Messages
154
Reaction score
1,216
Points
93
Location
Bucharest
Credits
103
Status
Not open for further replies.
Thread starter Similar threads Forum Replies Date
S Solved threads 3

Similar threads


shape1
shape2
shape3
shape4
shape7
shape8
Top